program: Orca
programVersion: 4.2.1
elementType: S O O O O O N N N N N N N N N N C C C C C C C C C C C C C H H H H H H H H H H H H H H H H
charge: 0
multiplicity: 1
keywords: wb97x-d3
keywords: def2-TZVPP
keywords: def2/J RIJCOSX GRIDX6 NOFINALGRIDX
keywords: grid4 nofinalgrid
keywords: scfconv7
keywords: smallprint printgap noloewdin
keywords: NOSOSCF
formula: C13H16N10O5S
InChI: InChI=1S/C13H16N10O5S/c1-22-11(7(6-14-22)10-18-21-23(2)19-10)29(25,26)20-13(24)17-12-15-8(27-3)5-9(16-12)28-4/h5-6,17,20H,1-4H3
45 atoms
S  -2.092615 0.87768 -1.351493
O  -2.778199 2.08058 -1.758658
O  -2.002036 -0.238018 -2.264831
O  -1.071262 2.810089 0.590077
O  5.351897 0.79612 1.296722
O  2.953861 -1.141216 -2.172092
N  -3.812002 0.904312 0.814859
N  -0.52564 1.230314 -0.945727
N  -4.168622 0.208511 1.878105
N  -1.410913 -2.998698 1.2424
N  -0.387304 -1.680573 -0.184336
N  -0.31184 -3.520741 0.772839
N  1.079031 2.137971 0.46927
N  0.312588 -2.759397 -0.075498
N  3.216842 1.480863 0.873199
N  2.002939 0.496544 -0.892686
C  -2.794732 0.306315 0.157901
C  -2.478719 -0.850857 0.85485
C  -3.382585 -0.847253 1.923234
C  -1.443881 -1.833315 0.625406
C  -4.516007 2.139209 0.52709
C  -0.23262 2.109406 0.065412
C  2.142276 1.329354 0.122374
C  0.156662 -4.83559 1.142064
C  4.24567 0.697853 0.58232
C  3.039471 -0.287619 -1.170391
C  4.219886 -0.235639 -0.447091
C  5.396025 1.732228 2.369367
C  1.796253 -1.124922 -3.004289
H  -3.473834 -1.57003 2.718792
H  0.212375 0.571503 -1.235691
H  -5.207431 2.301025 1.34703
H  -5.076823 2.063186 -0.400453
H  -3.824707 2.97399 0.473387
H  0.244913 -4.899384 2.222939
H  1.127548 -4.991947 0.684374
H  -0.542365 -5.588042 0.785476
H  5.064291 -0.869912 -0.674249
H  5.273748 2.756871 2.017697
H  6.38189 1.622681 2.813783
H  4.63785 1.519528 3.123404
H  1.66273 -0.154761 -3.484629
H  0.893192 -1.390631 -2.456048
H  1.976491 -1.874574 -3.770398
H  1.262659 2.773193 1.234937
elementType: S O N C H
totalener: -1826.98906784 hartree
nucrepener: 3234.73754330 hartree
electener: -5061.72661114 hartree
oneelecener: -8934.96357826 hartree
twoeener: 3873.23696711 hartree
cpcmener: -0.03852730 hartree
kineticenergy: 1820.60065053 hartree
xcener: -150.536764843902 hartree
chargesum: -0.0000000
charge: 0.874087 -0.484133 -0.484345 -0.458264 -0.292964 -0.289783 0.183220 -0.200440 -0.316608 -0.289878 -0.208648 0.266765 -0.139856 -0.200440 -0.424484 -0.411866 -0.127828 -0.120098 -0.069326 0.299135 -0.157877 0.368655 0.361266 -0.135709 0.413382 0.413772 -0.323926 -0.114854 -0.128053 0.159570 0.225590 0.113903 0.130526 0.126643 0.132205 0.122165 0.133094 0.144041 0.112956 0.130491 0.112814 0.123175 0.102681 0.139395 0.189850
qa: 0.8741 -0.4841 -0.4843 -0.4583 -0.2930 -0.2898 0.1832 -0.2004 -0.3166 -0.2899 -0.2086 0.2668 -0.1399 -0.2004 -0.4245 -0.4119 -0.1278 -0.1201 -0.0693 0.2991 -0.1579 0.3687 0.3613 -0.1357 0.4134 0.4138 -0.3239 -0.1149 -0.1281 0.1596 0.2256 0.1139 0.1305 0.1266 0.1322 0.1222 0.1331 0.1440 0.1130 0.1305 0.1128 0.1232 0.1027 0.1394 0.1898
va: 5.8895 2.0176 2.0077 2.0545 2.1288 2.1296 3.3613 3.0751 2.9112 2.9331 2.9344 3.4008 3.1809 2.8319 2.9683 2.9594 4.0496 3.7696 4.1025 4.0529 3.8541 4.3992 4.2549 3.8638 4.0248 3.9848 3.9455 3.8504 3.8411 1.0106 1.0536 1.0101 0.9920 1.0005 0.9922 1.0004 0.9903 1.0169 0.9957 0.9939 0.9960 0.9927 0.9972 0.9939 1.0188
dispcorr: -0.026067680 hartree
energy: -1827.015135521543
dipole: 10.00928 -7.57155 2.43773 -4.76254 2.89160 -1.87094 5.29294 -3.63208 1.66085
magnitude: 3.49305 au
magnitude: 8.87862 debye
