program: Orca
programVersion: 4.2.1
elementType: S O O O O O N N N N N N N N N N C C C C C C C C C C C C C H H H H H H H H H H H H H H H H
charge: 0
multiplicity: 1
keywords: wb97x-d3
keywords: def2-TZVPP
keywords: def2/J RIJCOSX GRIDX6 NOFINALGRIDX
keywords: grid4 nofinalgrid
keywords: scfconv7
keywords: smallprint printgap noloewdin
keywords: NOSOSCF
formula: C13H16N10O5S
InChI: InChI=1S/C13H16N10O5S/c1-22-11(7(6-14-22)10-18-21-23(2)19-10)29(25,26)20-13(24)17-12-15-8(27-3)5-9(16-12)28-4/h5-6,17,20H,1-4H3
45 atoms
S  -2.109591 1.697501 0.640019
O  -1.957207 1.555384 2.068853
O  -2.763173 2.866106 0.101349
O  -1.22211 1.699234 -2.149109
O  4.999977 -0.887768 -1.585596
O  2.950588 0.405234 2.370183
N  -4.071358 0.263858 -0.672108
N  -0.577306 1.56634 0.024359
N  -4.400804 -0.951383 -1.070197
N  -0.702616 -2.744619 0.102586
N  -0.474721 -1.087487 1.528552
N  0.363163 -2.861569 0.845866
N  0.911666 1.115137 -1.703971
N  0.522289 -1.891694 1.695927
N  2.961837 0.136521 -1.64734
N  1.918235 0.787292 0.365689
C  -2.893331 0.261049 -0.013209
C  -2.439776 -1.049607 0.011766
C  -3.434169 -1.754054 -0.676671
C  -1.221446 -1.615138 0.547961
C  -4.955122 1.365553 -1.005821
C  -0.35619 1.486044 -1.330085
C  1.975926 0.665762 -0.948483
C  1.293405 -3.960269 0.728175
C  3.982689 -0.339128 -0.948013
C  2.948138 0.305117 1.056561
C  4.034761 -0.294316 0.440108
C  4.963206 -0.958056 -3.00845
C  1.897701 1.111982 3.022379
H  -3.474933 -2.812081 -0.882641
H  0.192363 1.30362 0.656896
H  -4.486536 2.032397 -1.724371
H  -5.24206 1.920764 -0.117868
H  -5.842658 0.928375 -1.450394
H  0.786726 -4.895877 0.949861
H  2.097175 -3.801196 1.439229
H  1.695508 -3.991784 -0.28111
H  4.871782 -0.684938 1.00022
H  4.925958 0.032603 -3.461705
H  4.116188 -1.546279 -3.361827
H  5.886919 -1.450381 -3.301287
H  0.930381 0.632047 2.87793
H  1.847801 2.15031 2.691817
H  2.144692 1.091342 4.080671
H  1.036598 1.031076 -2.70468
elementType: S O N C H
totalener: -1826.98683465 hartree
nucrepener: 3291.82628579 hartree
electener: -5118.81312044 hartree
oneelecener: -9048.67471593 hartree
twoeener: 3929.86159550 hartree
cpcmener: -0.04143091 hartree
kineticenergy: 1820.58442877 hartree
xcener: -150.532991776736 hartree
chargesum: -0.0000000
charge: 0.869426 -0.478360 -0.478608 -0.444130 -0.291432 -0.284378 0.168454 -0.215901 -0.312846 -0.278687 -0.197628 0.253272 -0.137565 -0.169102 -0.419120 -0.420389 -0.107787 -0.095689 -0.072605 0.232298 -0.156221 0.354874 0.354813 -0.142762 0.415311 0.407323 -0.322264 -0.115664 -0.126231 0.160260 0.225495 0.127280 0.129506 0.114775 0.138436 0.123332 0.133455 0.142589 0.113906 0.112554 0.131589 0.104851 0.122684 0.139213 0.191674
qa: 0.8694 -0.4784 -0.4786 -0.4441 -0.2914 -0.2844 0.1685 -0.2159 -0.3128 -0.2787 -0.1976 0.2533 -0.1376 -0.1691 -0.4191 -0.4204 -0.1078 -0.0957 -0.0726 0.2323 -0.1562 0.3549 0.3548 -0.1428 0.4153 0.4073 -0.3223 -0.1157 -0.1262 0.1603 0.2255 0.1273 0.1295 0.1148 0.1384 0.1233 0.1335 0.1426 0.1139 0.1126 0.1316 0.1049 0.1227 0.1392 0.1917
va: 5.8868 2.0034 2.0223 2.0669 2.1316 2.1289 3.3781 3.0681 2.9083 2.9017 2.9124 3.4251 3.1829 2.8353 2.9638 2.9370 4.0621 3.6792 4.1081 4.0791 3.8600 4.4147 4.2494 3.8575 4.0199 3.9730 3.9333 3.8498 3.8344 1.0096 1.0550 0.9951 0.9944 1.0102 0.9925 0.9999 0.9904 1.0180 0.9952 0.9960 0.9937 0.9982 0.9908 0.9943 1.0175
dispcorr: -0.028130691 hartree
energy: -1827.014965336862
dipole: 10.99069 -8.16486 2.82582 -7.55025 5.05162 -2.49863 -3.26473 2.46454 -0.80019
magnitude: 3.85600 au
magnitude: 9.80117 debye
