program: Orca
programVersion: 4.2.1
elementType: S O O O O O N N N N N N N N N N C C C C C C C C C C C C C H H H H H H H H H H H H H H H H
charge: 0
multiplicity: 1
keywords: wb97x-d3
keywords: def2-TZVPP
keywords: def2/J RIJCOSX GRIDX6 NOFINALGRIDX
keywords: grid4 nofinalgrid
keywords: scfconv7
keywords: smallprint printgap noloewdin
keywords: NOSOSCF
formula: C13H16N10O5S
InChI: InChI=1S/C13H16N10O5S/c1-22-11(7(6-14-22)10-18-21-23(2)19-10)29(25,26)20-13(24)17-12-15-8(27-3)5-9(16-12)28-4/h5-6,17,20H,1-4H3
45 atoms
S  -2.088933 0.860201 -1.343477
O  -2.786572 2.050079 -1.769443
O  -1.990057 -0.275844 -2.231744
O  -1.060312 2.846717 0.550212
O  5.347641 0.795536 1.294749
O  2.956097 -1.138077 -2.181215
N  -3.80739 0.906295 0.823248
N  -0.524219 1.235251 -0.956973
N  -4.160239 0.220526 1.894386
N  -1.421312 -3.008786 1.238469
N  -0.338085 -1.64442 -0.100221
N  -0.305428 -3.518273 0.793022
N  1.086765 2.160824 0.438729
N  0.353783 -2.730317 -0.003225
N  3.220057 1.494052 0.855362
N  2.008254 0.508178 -0.910789
C  -2.784817 0.307542 0.174705
C  -2.462432 -0.839383 0.885196
C  -3.366944 -0.829407 1.952659
C  -1.425326 -1.821843 0.662557
C  -4.52827 2.129288 0.517586
C  -0.225298 2.133225 0.037492
C  2.148061 1.345157 0.100458
C  0.144518 -4.849192 1.129174
C  4.246134 0.704324 0.57221
C  3.042543 -0.280673 -1.182549
C  4.221239 -0.23065 -0.456109
C  5.384911 1.720803 2.377961
C  1.789851 -1.138242 -3.001696
H  -3.453167 -1.542605 2.757363
H  0.210165 0.567134 -1.233491
H  -3.848856 2.973583 0.458635
H  -5.226062 2.287812 1.332798
H  -5.083656 2.033791 -0.411263
H  -0.551017 -5.582942 0.729598
H  0.205851 -4.951109 2.209119
H  1.125627 -4.996623 0.690453
H  5.063339 -0.870007 -0.677545
H  6.37021 1.610219 2.823295
H  4.625824 1.49516 3.127283
H  5.258598 2.748604 2.037624
H  0.897149 -1.419583 -2.444046
H  1.973955 -1.884326 -3.770468
H  1.634575 -0.170102 -3.479264
H  1.27152 2.806278 1.195651
elementType: S O N C H
totalener: -1826.98915552 hartree
nucrepener: 3234.45584578 hartree
electener: -5061.44500130 hartree
oneelecener: -8934.43413385 hartree
twoeener: 3872.98913254 hartree
cpcmener: -0.03854899 hartree
kineticenergy: 1820.58346172 hartree
xcener: -150.533060396310 hartree
chargesum: -0.0000000
charge: 0.873474 -0.484345 -0.486219 -0.457510 -0.293069 -0.289905 0.181780 -0.197706 -0.316008 -0.290088 -0.209187 0.268191 -0.139891 -0.201580 -0.423837 -0.411037 -0.125926 -0.115766 -0.070368 0.294790 -0.157295 0.367797 0.359996 -0.136033 0.413424 0.414379 -0.324449 -0.114986 -0.126114 0.160168 0.223663 0.126556 0.114094 0.130549 0.133597 0.132003 0.122219 0.143996 0.130547 0.113254 0.112824 0.102551 0.139478 0.122202 0.189783
qa: 0.8735 -0.4843 -0.4862 -0.4575 -0.2931 -0.2899 0.1818 -0.1977 -0.3160 -0.2901 -0.2092 0.2682 -0.1399 -0.2016 -0.4238 -0.4110 -0.1259 -0.1158 -0.0704 0.2948 -0.1573 0.3678 0.3600 -0.1360 0.4134 0.4144 -0.3244 -0.1150 -0.1261 0.1602 0.2237 0.1266 0.1141 0.1305 0.1336 0.1320 0.1222 0.1440 0.1305 0.1133 0.1128 0.1026 0.1395 0.1222 0.1898
va: 5.8900 2.0175 2.0051 2.0554 2.1286 2.1296 3.3628 3.0752 2.9101 2.9298 2.9306 3.3976 3.1813 2.8277 2.9685 2.9571 4.0445 3.7698 4.1012 4.0477 3.8537 4.4012 4.2563 3.8637 4.0248 3.9852 3.9463 3.8502 3.8419 1.0101 1.0556 1.0002 1.0102 0.9922 0.9904 0.9921 1.0004 1.0169 0.9938 0.9959 0.9957 0.9976 0.9938 0.9927 1.0188
dispcorr: -0.026094156 hartree
energy: -1827.015249677089
dipole: 9.79971 -7.41180 2.38792 -4.93331 3.03051 -1.90281 5.18205 -3.54445 1.63760
magnitude: 3.46476 au
magnitude: 8.80671 debye
