program: Orca
programVersion: 4.2.1
elementType: S O O O O O N N N N N N N N N N C C C C C C C C C C C C C H H H H H H H H H H H H H H H H
charge: 0
multiplicity: 1
keywords: wb97x-d3
keywords: def2-TZVPP
keywords: def2/J RIJCOSX GRIDX6 NOFINALGRIDX
keywords: grid4 nofinalgrid
keywords: scfconv7
keywords: smallprint printgap noloewdin
keywords: NOSOSCF
formula: C13H16N10O5S
InChI: InChI=1S/C13H16N10O5S/c1-22-11(7(6-14-22)10-18-21-23(2)19-10)29(25,26)20-13(24)17-12-15-8(27-3)5-9(16-12)28-4/h5-6,17,20H,1-4H3
45 atoms
S  -2.020459 0.980497 1.452517
O  -1.871598 -0.065447 2.43774
O  -2.684948 2.210421 1.811376
O  -1.127524 2.777369 -0.67152
O  5.186674 0.597655 -1.738777
O  3.068693 -1.011427 2.064331
N  -3.866717 0.846121 -0.602596
N  -0.48118 1.300522 0.92677
N  -4.266074 0.086661 -1.605595
N  -1.379279 -2.997349 -1.031789
N  -0.370774 -1.659068 0.387415
N  -0.257818 -3.490286 -0.584141
N  1.021609 2.091777 -0.660343
N  0.358694 -2.716252 0.258553
N  3.10843 1.362119 -1.189034
N  2.035296 0.542632 0.74442
C  -2.80359 0.30287 0.029012
C  -2.501773 -0.885127 -0.620821
C  -3.461835 -0.955488 -1.637008
C  -1.435246 -1.836924 -0.406841
C  -4.576379 2.085238 -0.346636
C  -0.256788 2.105833 -0.160755
C  2.100103 1.29171 -0.340798
C  0.243267 -4.787326 -0.972827
C  4.145877 0.580393 -0.92648
C  3.079996 -0.240538 0.994495
C  4.19402 -0.270907 0.171334
C  5.151791 1.447579 -2.882186
C  1.986323 -0.909335 2.98779
H  -3.581362 -1.723558 -2.384895
H  0.27509 0.661746 1.214614
H  -5.069693 2.06168 0.621101
H  -5.327185 2.178539 -1.124079
H  -3.901904 2.934082 -0.398895
H  0.309605 -4.840039 -2.055978
H  -0.423622 -5.563903 -0.606805
H  1.229175 -4.915753 -0.538442
H  5.044753 -0.90485 0.374369
H  6.091742 1.278605 -3.401229
H  5.080627 2.498751 -2.602161
H  4.325039 1.196655 -3.546948
H  2.219643 -1.606451 3.788404
H  1.035567 -1.193508 2.538657
H  1.910215 0.095568 3.404776
H  1.151093 2.668963 -1.481153
elementType: S O N C H
totalener: -1826.98890309 hartree
nucrepener: 3241.88149041 hartree
electener: -5068.87039350 hartree
oneelecener: -8949.21026118 hartree
twoeener: 3880.33986768 hartree
cpcmener: -0.03894509 hartree
kineticenergy: 1820.59087226 hartree
xcener: -150.534961265536 hartree
chargesum: -0.0000000
charge: 0.873233 -0.483047 -0.482300 -0.458290 -0.292948 -0.289725 0.183702 -0.204309 -0.316710 -0.290011 -0.208530 0.266270 -0.140455 -0.198335 -0.423839 -0.412831 -0.129995 -0.120339 -0.068803 0.300518 -0.157811 0.367970 0.361158 -0.136268 0.413120 0.413555 -0.323313 -0.114067 -0.128238 0.159106 0.226955 0.131322 0.113802 0.126112 0.132383 0.133566 0.121753 0.143593 0.130652 0.113246 0.112202 0.139577 0.102601 0.124059 0.189710
qa: 0.8732 -0.4830 -0.4823 -0.4583 -0.2929 -0.2897 0.1837 -0.2043 -0.3167 -0.2900 -0.2085 0.2663 -0.1405 -0.1983 -0.4238 -0.4128 -0.1300 -0.1203 -0.0688 0.3005 -0.1578 0.3680 0.3612 -0.1363 0.4131 0.4136 -0.3233 -0.1141 -0.1282 0.1591 0.2270 0.1313 0.1138 0.1261 0.1324 0.1336 0.1218 0.1436 0.1307 0.1132 0.1122 0.1396 0.1026 0.1241 0.1897
va: 5.8900 2.0087 2.0191 2.0539 2.1291 2.1290 3.3600 3.0728 2.9132 2.9344 2.9373 3.4039 3.1814 2.8356 2.9677 2.9576 4.0556 3.7589 4.1048 4.0619 3.8534 4.3998 4.2538 3.8635 4.0257 3.9839 3.9472 3.8501 3.8400 1.0114 1.0527 0.9918 1.0101 1.0003 0.9922 0.9901 1.0005 1.0170 0.9938 0.9955 0.9962 0.9937 0.9978 0.9923 1.0189
dispcorr: -0.026231690 hartree
energy: -1827.015134777748
dipole: 9.80634 -7.42034 2.38600 -5.14596 3.17281 -1.97315 -6.04498 4.24839 -1.79659
magnitude: 3.57968 au
magnitude: 9.09881 debye
