program: Orca
programVersion: 4.2.1
elementType: S O O O O O N N N N N N N N N N C C C C C C C C C C C C C H H H H H H H H H H H H H H H H
charge: 0
multiplicity: 1
keywords: wb97x-d3
keywords: def2-TZVPP
keywords: def2/J RIJCOSX GRIDX6 NOFINALGRIDX
keywords: grid4 nofinalgrid
keywords: scfconv7
keywords: smallprint printgap noloewdin
keywords: NOSOSCF
formula: C13H16N10O5S
InChI: InChI=1S/C13H16N10O5S/c1-22-11(7(6-14-22)10-18-21-23(2)19-10)29(25,26)20-13(24)17-12-15-8(27-3)5-9(16-12)28-4/h5-6,17,20H,1-4H3
45 atoms
S  -1.551735 1.608711 1.19074
O  -1.022784 1.171579 2.462629
O  -2.137231 2.922297 1.065949
O  -1.492051 1.972613 -1.716786
O  3.720064 0.009384 1.197354
O  4.714941 -0.237795 -3.328647
N  -3.947724 0.693416 0.152814
N  -0.287599 1.452617 0.134717
N  -4.624425 -0.412371 -0.094654
N  -1.643258 -3.054671 1.489035
N  -0.211334 -1.422567 1.148083
N  -0.410302 -3.406276 1.730809
N  0.645366 1.300636 -1.98575
N  0.456175 -2.456592 1.538684
N  2.171512 0.652616 -0.355229
N  2.678586 0.541468 -2.655826
C  -2.720203 0.415032 0.643025
C  -2.606936 -0.964973 0.709905
C  -3.840457 -1.419538 0.231327
C  -1.498546 -1.795954 1.122667
C  -4.584963 1.969194 -0.116221
C  -0.449722 1.606268 -1.21727
C  1.88618 0.81024 -1.635195
C  -0.04158 -4.724134 2.192379
C  3.376941 0.172991 -0.065859
C  3.874569 0.057302 -2.353873
C  4.297071 -0.157412 -1.047226
C  2.810225 0.40319 2.222589
C  4.306454 -0.025044 -4.676908
H  -4.169024 -2.43927 0.106037
H  0.573539 0.998173 0.469942
H  -5.532399 1.747007 -0.595518
H  -3.978297 2.57025 -0.785586
H  -4.772062 2.514496 0.804913
H  1.039814 -4.767738 2.266099
H  -0.39223 -5.470077 1.48442
H  -0.483765 -4.907101 3.168347
H  5.276325 -0.548333 -0.81246
H  3.329263 0.219805 3.159766
H  1.89762 -0.191434 2.202231
H  2.562726 1.463315 2.15728
H  5.146867 -0.339098 -5.290492
H  4.091975 1.025574 -4.873539
H  3.432171 -0.623483 -4.933684
H  0.495791 1.406939 -2.980626
elementType: S O N C H
totalener: -1826.99011964 hartree
nucrepener: 3208.45754253 hartree
electener: -5035.44766217 hartree
oneelecener: -8882.47683975 hartree
twoeener: 3847.02917758 hartree
cpcmener: -0.03820417 hartree
kineticenergy: 1820.58890100 hartree
xcener: -150.534260669899 hartree
chargesum: -0.0000000
charge: 0.868575 -0.485500 -0.484491 -0.462932 -0.290616 -0.293038 0.182033 -0.192896 -0.316116 -0.289557 -0.208413 0.267384 -0.136014 -0.201684 -0.416935 -0.427132 -0.120189 -0.111284 -0.072540 0.287920 -0.158671 0.374066 0.365345 -0.136168 0.416440 0.413984 -0.326487 -0.127195 -0.115803 0.160919 0.222917 0.114693 0.126304 0.130684 0.121865 0.132030 0.133722 0.144311 0.138734 0.106572 0.119373 0.131367 0.113102 0.112494 0.188827
qa: 0.8686 -0.4855 -0.4845 -0.4629 -0.2906 -0.2930 0.1820 -0.1929 -0.3161 -0.2896 -0.2084 0.2674 -0.1360 -0.2017 -0.4169 -0.4271 -0.1202 -0.1113 -0.0725 0.2879 -0.1587 0.3741 0.3653 -0.1362 0.4164 0.4140 -0.3265 -0.1272 -0.1158 0.1609 0.2229 0.1147 0.1263 0.1307 0.1219 0.1320 0.1337 0.1443 0.1387 0.1066 0.1194 0.1314 0.1131 0.1125 0.1888
va: 5.8944 2.0061 2.0174 2.0521 2.1360 2.1292 3.3613 3.0810 2.9086 2.9227 2.9313 3.4020 3.1816 2.8275 2.9635 2.9682 4.0403 3.7728 4.1008 4.0417 3.8542 4.3944 4.2519 3.8640 3.9947 4.0250 3.9368 3.8438 3.8506 1.0094 1.0526 1.0097 1.0012 0.9916 1.0002 0.9920 0.9906 1.0168 0.9947 0.9957 0.9941 0.9937 0.9957 0.9958 1.0196
dispcorr: -0.025492141 hartree
energy: -1827.015611778770
dipole: 7.89799 -6.11220 1.78579 -7.16935 4.58157 -2.58777 -4.07143 3.23979 -0.83164
magnitude: 3.25227 au
magnitude: 8.26660 debye
