program: Orca
programVersion: 4.2.1
elementType: S O O O O O N N N N N N N N N N C C C C C C C C C C C C C H H H H H H H H H H H H H H H H
charge: 0
multiplicity: 1
keywords: wb97x-d3
keywords: def2-TZVPP
keywords: def2/J RIJCOSX GRIDX6 NOFINALGRIDX
keywords: grid4 nofinalgrid
keywords: scfconv7
keywords: smallprint printgap noloewdin
keywords: NOSOSCF
formula: C13H16N10O5S
InChI: InChI=1S/C13H16N10O5S/c1-22-11(7(6-14-22)10-18-21-23(2)19-10)29(25,26)20-13(24)17-12-15-8(27-3)5-9(16-12)28-4/h5-6,17,20H,1-4H3
45 atoms
S  -1.548598 1.625824 1.182686
O  -1.017557 1.217933 2.462806
O  -2.130155 2.938242 1.032305
O  -1.503258 1.923611 -1.731149
O  3.727418 0.041692 1.198961
O  4.723819 -0.245966 -3.324629
N  -3.950395 0.697985 0.171796
N  -0.289113 1.440585 0.12414
N  -4.631402 -0.409634 -0.054491
N  -1.642887 -3.062658 1.462211
N  -0.219483 -1.403701 1.233286
N  -0.414032 -3.413124 1.723023
N  0.638389 1.263976 -1.996764
N  0.447467 -2.448074 1.596888
N  2.172073 0.650307 -0.360351
N  2.678933 0.517797 -2.659816
C  -2.720882 0.424098 0.660044
C  -2.609987 -0.955183 0.745913
C  -3.84782 -1.413595 0.281272
C  -1.501602 -1.787405 1.155285
C  -4.584064 1.971008 -0.115971
C  -0.456741 1.573033 -1.228856
C  1.884015 0.789893 -1.641885
C  -0.046235 -4.747562 2.134899
C  3.38268 0.186943 -0.066029
C  3.880301 0.050373 -2.352871
C  4.305694 -0.145189 -1.044076
C  2.813107 0.439166 2.218851
C  4.315045 -0.047584 -4.674805
H  -4.179859 -2.434257 0.174015
H  0.579656 1.004583 0.46494
H  -3.967915 2.567828 -0.78003
H  -4.785641 2.522733 0.798473
H  -5.523832 1.745541 -0.608668
H  -0.389241 -5.463938 1.393462
H  -0.49699 -4.971491 3.098454
H  1.034551 -4.792651 2.216489
H  5.289174 -0.522999 -0.805483
H  1.903906 -0.16079 2.202354
H  2.559257 1.497159 2.143118
H  3.331514 0.2681 3.158723
H  5.155416 -0.367814 -5.285283
H  4.100775 1.001141 -4.882023
H  3.440677 -0.648271 -4.925843
H  0.486613 1.354784 -2.99288
elementType: S O N C H
totalener: -1826.99007155 hartree
nucrepener: 3207.00709661 hartree
electener: -5033.99716816 hartree
oneelecener: -8879.55668722 hartree
twoeener: 3845.55951906 hartree
cpcmener: -0.03824687 hartree
kineticenergy: 1820.58818566 hartree
xcener: -150.534429520004 hartree
chargesum: 0.0000000
charge: 0.868565 -0.483872 -0.484526 -0.463515 -0.290511 -0.292976 0.182677 -0.195250 -0.316475 -0.289323 -0.205800 0.265796 -0.136255 -0.201031 -0.417689 -0.427297 -0.122637 -0.115229 -0.071301 0.291713 -0.157841 0.374953 0.366011 -0.136302 0.416098 0.414114 -0.326403 -0.127905 -0.115832 0.160163 0.224102 0.124825 0.131245 0.114678 0.132199 0.133638 0.121833 0.144377 0.107321 0.119258 0.138516 0.131408 0.113349 0.112198 0.188932
qa: 0.8686 -0.4839 -0.4845 -0.4635 -0.2905 -0.2930 0.1827 -0.1952 -0.3165 -0.2893 -0.2058 0.2658 -0.1363 -0.2010 -0.4177 -0.4273 -0.1226 -0.1152 -0.0713 0.2917 -0.1578 0.3750 0.3660 -0.1363 0.4161 0.4141 -0.3264 -0.1279 -0.1158 0.1602 0.2241 0.1248 0.1312 0.1147 0.1322 0.1336 0.1218 0.1444 0.1073 0.1193 0.1385 0.1314 0.1133 0.1122 0.1889
va: 5.8948 2.0081 2.0176 2.0520 2.1367 2.1292 3.3600 3.0807 2.9102 2.9256 2.9372 3.4055 3.1815 2.8308 2.9651 2.9680 4.0446 3.7713 4.1019 4.0503 3.8547 4.3934 4.2511 3.8638 3.9957 4.0249 3.9358 3.8433 3.8507 1.0102 1.0514 1.0020 0.9912 1.0094 0.9922 0.9904 1.0002 1.0168 0.9956 0.9943 0.9948 0.9937 0.9956 0.9959 1.0195
dispcorr: -0.025424653 hartree
energy: -1827.015496202871
dipole: 7.91908 -6.12409 1.79499 -7.23275 4.62540 -2.60735 -4.29295 3.40907 -0.88388
magnitude: 3.28656 au
magnitude: 8.35377 debye
