program: Orca
programVersion: 4.2.1
elementType: S O O O O O N N N N N N N N N N C C C C C C C C C C C C C H H H H H H H H H H H H H H H H
charge: 0
multiplicity: 1
keywords: wb97x-d3
keywords: def2-TZVPP
keywords: def2/J RIJCOSX GRIDX6 NOFINALGRIDX
keywords: grid4 nofinalgrid
keywords: scfconv7
keywords: smallprint printgap noloewdin
keywords: NOSOSCF
formula: C13H16N10O5S
InChI: InChI=1S/C13H16N10O5S/c1-22-11(7(6-14-22)10-18-21-23(2)19-10)29(25,26)20-13(24)17-12-15-8(27-3)5-9(16-12)28-4/h5-6,17,20H,1-4H3
45 atoms
S  -2.040782 0.720713 -1.3409
O  -2.702707 1.902038 -1.830489
O  -1.896133 -0.450847 -2.1691
O  -1.052068 2.716275 0.618211
O  3.109435 -1.109506 -2.155579
O  5.567461 1.309143 0.952779
N  -3.833371 0.902333 0.757222
N  -0.489902 1.091277 -0.872948
N  -4.275045 0.262133 1.824151
N  -1.696583 -3.121171 1.350002
N  -0.434751 -1.831161 0.091231
N  -0.577975 -3.696017 0.992312
N  1.114696 2.113354 0.462803
N  0.185318 -2.94956 0.243182
N  2.090431 0.480674 -0.873344
N  3.336879 1.716219 0.704795
C  -2.816402 0.238811 0.165984
C  -2.589374 -0.90503 0.91359
C  -3.543297 -0.825546 1.935929
C  -1.593027 -1.940464 0.768098
C  -4.444236 2.173044 0.414082
C  -0.216445 2.021471 0.093821
C  2.222542 1.396157 0.069641
C  -0.220516 -5.036319 1.38117
C  3.185312 -0.19004 -1.215406
C  4.42012 1.039495 0.35367
C  4.415098 0.049727 -0.62139
C  1.85523 -1.347694 -2.785052
C  5.587986 2.315863 1.951334
H  -3.705926 -1.520943 2.743573
H  0.254328 0.438624 -1.142863
H  -4.957059 2.115205 -0.541792
H  -3.693064 2.955341 0.374612
H  -5.160622 2.384022 1.200526
H  -0.957322 -5.741198 1.003726
H  -0.175138 -5.108449 2.465118
H  0.752827 -5.258683 0.956561
H  5.305489 -0.49259 -0.899383
H  1.489169 -0.459289 -3.301589
H  1.100898 -1.684566 -2.075253
H  2.040444 -2.131824 -3.513951
H  5.294435 3.287774 1.553642
H  6.616562 2.362662 2.299131
H  4.932396 2.070983 2.787566
H  1.289784 2.794268 1.186304
totalener: -1826.96523864 hartree
nucrepener: 3203.83625354 hartree
electener: -5030.80149218 hartree
oneelecener: -8872.40996761 hartree
twoeener: 3841.60847543 hartree
kineticenergy: 1820.62295072 hartree
xcener: -150.532104115849 hartree
chargesum: -0.0000000
charge: 0.848778 -0.437780 -0.441426 -0.397134 -0.262937 -0.265463 0.178843 -0.199179 -0.280028 -0.270099 -0.190341 0.233586 -0.162761 -0.178788 -0.413598 -0.409126 -0.138514 -0.126468 -0.061623 0.287399 -0.176497 0.354124 0.357289 -0.153998 0.406002 0.383810 -0.306467 -0.134855 -0.125721 0.137006 0.216064 0.121795 0.138126 0.112973 0.123848 0.120892 0.122320 0.127659 0.111076 0.120930 0.125020 0.108273 0.123102 0.107290 0.166598
qa: 0.8488 -0.4378 -0.4414 -0.3971 -0.2629 -0.2655 0.1788 -0.1992 -0.2800 -0.2701 -0.1903 0.2336 -0.1628 -0.1788 -0.4136 -0.4091 -0.1385 -0.1265 -0.0616 0.2874 -0.1765 0.3541 0.3573 -0.1540 0.4060 0.3838 -0.3065 -0.1349 -0.1257 0.1370 0.2161 0.1218 0.1381 0.1130 0.1238 0.1209 0.1223 0.1277 0.1111 0.1209 0.1250 0.1083 0.1231 0.1073 0.1666
va: 5.9109 2.0676 2.0547 2.1159 2.1615 2.1467 3.3478 3.0865 2.9068 2.9051 2.9450 3.3681 3.1635 2.8247 2.9664 2.9729 4.0661 3.7899 4.0956 4.0419 3.8634 4.3853 4.2499 3.8849 4.0178 4.0559 3.9422 3.8644 3.8779 1.0151 1.0525 0.9944 0.9979 1.0091 0.9925 0.9929 1.0010 1.0224 0.9967 0.9924 0.9955 0.9969 0.9941 0.9970 1.0370
dispcorr: -0.025414687 hartree
energy: -1826.990653323577
dipole: 9.69865 -8.03111 1.66753 -3.95163 2.61631 -1.33531 4.93815 -3.78796 1.15019
magnitude: 2.42625 au
magnitude: 6.16702 debye
