program: Orca
programVersion: 4.2.1
elementType: S O O O O O N N N N N N N N N N C C C C C C C C C C C C C H H H H H H H H H H H H H H H H
charge: 0
multiplicity: 1
keywords: wb97x-d3
keywords: def2-TZVPP
keywords: def2/J RIJCOSX GRIDX6 NOFINALGRIDX
keywords: grid4 nofinalgrid
keywords: scfconv7
keywords: smallprint printgap noloewdin
keywords: NOSOSCF
formula: C13H16N10O5S
InChI: InChI=1S/C13H16N10O5S/c1-22-11(7(6-14-22)10-18-21-23(2)19-10)29(25,26)20-13(24)17-12-15-8(27-3)5-9(16-12)28-4/h5-6,17,20H,1-4H3
45 atoms
S  -2.028111 0.756385 -1.324839
O  -2.679947 1.95355 -1.788704
O  -1.885474 -0.395091 -2.180805
O  -1.039476 2.699693 0.68459
O  3.123602 -1.068734 -2.164951
O  5.577404 1.277008 1.002326
N  -3.831872 0.898393 0.766996
N  -0.477083 1.105439 -0.839061
N  -4.284956 0.233967 1.81415
N  -1.724969 -3.153001 1.26931
N  -0.447816 -1.839342 0.051019
N  -0.608211 -3.725716 0.903078
N  1.1262 2.095123 0.522553
N  0.164275 -2.965627 0.177723
N  2.102802 0.491191 -0.847624
N  3.347507 1.690596 0.759562
C  -2.815417 0.243285 0.165497
C  -2.601226 -0.920953 0.884774
C  -3.561541 -0.861454 1.902416
C  -1.610182 -1.958337 0.718693
C  -4.432077 2.181359 0.45208
C  -0.204132 2.014026 0.147803
C  2.233968 1.385595 0.115682
C  -0.262814 -5.078122 1.259788
C  3.198473 -0.170767 -1.20408
C  4.43103 1.021377 0.395253
C  4.42741 0.054776 -0.602738
C  1.870217 -1.291415 -2.801883
C  5.59551 2.257888 2.026327
H  -3.734296 -1.576282 2.690724
H  0.265644 0.45597 -1.120401
H  -4.942203 2.149681 -0.506593
H  -3.674715 2.958505 0.433229
H  -5.149491 2.379392 1.241098
H  0.708902 -5.299118 0.830731
H  -1.005762 -5.76674 0.864732
H  -0.219295 -5.176802 2.341712
H  5.318012 -0.481223 -0.892112
H  2.05708 -2.055908 -3.55096
H  1.503864 -0.390066 -3.295276
H  1.115346 -1.647677 -2.102111
H  5.30136 3.239404 1.653409
H  6.623576 2.296816 2.376716
H  4.939032 1.990692 2.855026
H  1.301785 2.759754 1.260918
totalener: -1826.96524330 hartree
nucrepener: 3202.56418183 hartree
electener: -5029.52942512 hartree
oneelecener: -8869.86882384 hartree
twoeener: 3840.33939871 hartree
kineticenergy: 1820.62229673 hartree
xcener: -150.531919277022 hartree
chargesum: -0.0000000
charge: 0.848843 -0.437772 -0.441140 -0.397418 -0.262993 -0.265454 0.178793 -0.199810 -0.279991 -0.269993 -0.189918 0.233595 -0.163027 -0.178824 -0.413988 -0.409313 -0.137956 -0.126590 -0.061770 0.286991 -0.176476 0.354563 0.357745 -0.154239 0.405843 0.383971 -0.306699 -0.134630 -0.125536 0.136954 0.216506 0.121813 0.138008 0.113006 0.122267 0.124139 0.120771 0.127787 0.125079 0.111089 0.120611 0.108162 0.123034 0.107331 0.166638
qa: 0.8488 -0.4378 -0.4411 -0.3974 -0.2630 -0.2655 0.1788 -0.1998 -0.2800 -0.2700 -0.1899 0.2336 -0.1630 -0.1788 -0.4140 -0.4093 -0.1380 -0.1266 -0.0618 0.2870 -0.1765 0.3546 0.3577 -0.1542 0.4058 0.3840 -0.3067 -0.1346 -0.1255 0.1370 0.2165 0.1218 0.1380 0.1130 0.1223 0.1241 0.1208 0.1278 0.1251 0.1111 0.1206 0.1082 0.1230 0.1073 0.1666
va: 5.9107 2.0677 2.0552 2.1158 2.1616 2.1468 3.3478 3.0870 2.9068 2.9048 2.9455 3.3686 3.1636 2.8246 2.9660 2.9726 4.0657 3.7900 4.0960 4.0416 3.8637 4.3852 4.2491 3.8848 4.0183 4.0561 3.9423 3.8648 3.8779 1.0152 1.0517 0.9943 0.9980 1.0091 1.0010 0.9925 0.9929 1.0223 0.9955 0.9966 0.9924 0.9969 0.9941 0.9970 1.0370
dispcorr: -0.025377106 hartree
energy: -1826.990620403762
dipole: 9.65222 -8.00025 1.65197 -4.09075 2.72133 -1.36941 4.86548 -3.74404 1.12144
magnitude: 2.42114 au
magnitude: 6.15405 debye
