program: Orca
programVersion: 4.2.1
elementType: S O O O O O N N N N N N N N N N C C C C C C C C C C C C C H H H H H H H H H H H H H H H H
charge: 0
multiplicity: 1
keywords: wb97x-d3
keywords: def2-TZVPP
keywords: def2/J RIJCOSX GRIDX6 NOFINALGRIDX
keywords: grid4 nofinalgrid
keywords: scfconv7
keywords: smallprint printgap noloewdin
keywords: NOSOSCF
formula: C13H16N10O5S
InChI: InChI=1S/C13H16N10O5S/c1-22-11(7(6-14-22)10-18-21-23(2)19-10)29(25,26)20-13(24)17-12-15-8(27-3)5-9(16-12)28-4/h5-6,17,20H,1-4H3
45 atoms
S  -2.037094 0.721213 -1.2978
O  -2.721434 1.906388 -1.745148
O  -1.873299 -0.41752 -2.166837
O  -1.082203 2.658025 0.735115
O  5.530114 1.237146 1.124384
O  3.135395 -1.018993 -2.151484
N  -3.831843 0.796317 0.804287
N  -0.491036 1.10369 -0.819147
N  -4.256738 0.115457 1.852471
N  -1.567748 -3.167831 1.325926
N  -0.373715 -1.83519 0.045827
N  -0.43651 -3.70355 0.948355
N  1.091089 2.079622 0.576318
N  0.287595 -2.931544 0.186932
N  3.307055 1.664838 0.846218
N  2.092932 0.511792 -0.817133
C  -2.79892 0.17548 0.194386
C  -2.542488 -0.982743 0.910052
C  -3.497689 -0.956035 1.934073
C  -1.515211 -1.984095 0.742658
C  -4.47039 2.063479 0.500891
C  -0.235741 1.993275 0.18954
C  2.206035 1.379668 0.172271
C  -0.024038 -5.028212 1.336792
C  4.395958 1.001942 0.486664
C  3.193281 -0.145883 -1.166949
C  4.410298 0.060869 -0.535379
C  5.528087 2.18622 2.178017
C  1.894514 -1.222416 -2.818673
H  -3.642321 -1.677604 2.721956
H  0.263132 0.470799 -1.108484
H  -4.9815 2.025023 -0.456623
H  -3.736144 2.862389 0.486975
H  -5.191081 2.234146 1.293036
H  -0.75084 -5.75886 0.990446
H  0.059589 -5.08816 2.419322
H  0.941283 -5.224507 0.881989
H  5.305181 -0.470863 -0.819338
H  6.546946 2.207075 2.555684
H  4.848653 1.898871 2.981025
H  5.249968 3.180705 1.827906
H  2.092746 -1.974884 -3.576868
H  1.544807 -0.310106 -3.30392
H  1.122267 -1.586119 -2.142067
H  1.253831 2.72725 1.332518
totalener: -1826.96503410 hartree
nucrepener: 3209.31765823 hartree
electener: -5036.28269232 hartree
oneelecener: -8883.36493436 hartree
twoeener: 3847.08224204 hartree
kineticenergy: 1820.62381960 hartree
xcener: -150.532288829644 hartree
chargesum: 0.0000000
charge: 0.850179 -0.438036 -0.440641 -0.396172 -0.265451 -0.262676 0.179591 -0.200115 -0.280061 -0.270398 -0.190837 0.233709 -0.163121 -0.178709 -0.408710 -0.412332 -0.140471 -0.128397 -0.061172 0.289880 -0.175313 0.352448 0.356261 -0.153860 0.384098 0.406602 -0.307663 -0.125270 -0.134368 0.136937 0.215643 0.121490 0.137477 0.113061 0.123825 0.120797 0.122503 0.127609 0.122906 0.107125 0.108171 0.125183 0.111155 0.120438 0.166688
qa: 0.8502 -0.4380 -0.4406 -0.3962 -0.2655 -0.2627 0.1796 -0.2001 -0.2801 -0.2704 -0.1908 0.2337 -0.1631 -0.1787 -0.4087 -0.4123 -0.1405 -0.1284 -0.0612 0.2899 -0.1753 0.3524 0.3563 -0.1539 0.3841 0.4066 -0.3077 -0.1253 -0.1344 0.1369 0.2156 0.1215 0.1375 0.1131 0.1238 0.1208 0.1225 0.1276 0.1229 0.1071 0.1082 0.1252 0.1112 0.1204 0.1667
va: 5.9087 2.0672 2.0559 2.1167 2.1465 2.1609 3.3474 3.0856 2.9076 2.9067 2.9461 3.3684 3.1631 2.8238 2.9726 2.9659 4.0664 3.7878 4.0956 4.0464 3.8642 4.3867 4.2507 3.8847 4.0554 4.0168 3.9438 3.8780 3.8634 1.0153 1.0542 0.9946 0.9982 1.0092 0.9927 0.9927 1.0010 1.0224 0.9941 0.9971 0.9968 0.9954 0.9962 0.9930 1.0369
dispcorr: -0.025530137 hartree
energy: -1826.990564236770
dipole: 9.84759 -8.13912 1.70847 -4.04224 2.68704 -1.35520 5.13549 -3.97667 1.15881
magnitude: 2.46947 au
magnitude: 6.27689 debye
