program: Orca
programVersion: 4.2.1
elementType: S O O O O O N N N N N N N N N N C C C C C C C C C C C C C H H H H H H H H H H H H H H H H
charge: 0
multiplicity: 1
keywords: wb97x-d3
keywords: def2-TZVPP
keywords: def2/J RIJCOSX GRIDX6 NOFINALGRIDX
keywords: grid4 nofinalgrid
keywords: scfconv7
keywords: smallprint printgap noloewdin
keywords: NOSOSCF
formula: C13H16N10O5S
InChI: InChI=1S/C13H16N10O5S/c1-22-11(7(6-14-22)10-18-21-23(2)19-10)29(25,26)20-13(24)17-12-15-8(27-3)5-9(16-12)28-4/h5-6,17,20H,1-4H3
45 atoms
S  -2.028507 0.820298 -1.294139
O  -2.679553 2.036413 -1.706905
O  -1.892042 -0.295207 -2.197541
O  -1.033961 2.675117 0.792544
O  5.554753 1.1308 1.122743
O  3.10837 -1.004593 -2.195782
N  -3.827131 0.875483 0.806539
N  -0.476076 1.14585 -0.798108
N  -4.272604 0.171649 1.831065
N  -1.688535 -3.172552 1.178152
N  -0.436901 -1.823713 -0.027816
N  -0.571266 -3.728089 0.78773
N  1.127259 2.058081 0.617121
N  0.186374 -2.946835 0.069487
N  3.337493 1.60081 0.86669
N  2.096893 0.507865 -0.817561
C  -2.810468 0.247497 0.177446
C  -2.587153 -0.940601 0.853659
C  -3.543158 -0.922198 1.877163
C  -1.59031 -1.965864 0.650871
C  -4.432217 2.167412 0.542169
C  -0.201104 2.006973 0.230325
C  2.228947 1.349836 0.191692
C  -0.209758 -5.083523 1.115855
C  4.413985 0.929548 0.485355
C  3.184989 -0.157726 -1.189707
C  4.408251 0.013941 -0.559648
C  5.573918 2.055367 2.197917
C  1.861195 -1.170569 -2.861463
H  -3.70844 -1.665884 2.640026
H  0.263895 0.504375 -1.104153
H  -3.676674 2.946383 0.546589
H  -5.144697 2.33527 1.342365
H  -4.948515 2.169376 -0.413622
H  0.762149 -5.285766 0.677754
H  -0.947536 -5.772707 0.711539
H  -0.15951 -5.202503 2.195735
H  5.293256 -0.52446 -0.861492
H  4.897061 1.758577 2.99974
H  5.306467 3.061319 1.873024
H  6.595983 2.053885 2.56751
H  2.044951 -1.90104 -3.644485
H  1.520146 -0.238941 -3.315314
H  1.088412 -1.545776 -2.191799
H  1.301982 2.684858 1.388086
totalener: -1826.96513800 hartree
nucrepener: 3206.86936124 hartree
electener: -5033.83449923 hartree
oneelecener: -8878.47155649 hartree
twoeener: 3844.63705726 hartree
kineticenergy: 1820.62246928 hartree
xcener: -150.532050090062 hartree
chargesum: -0.0000000
charge: 0.849268 -0.437871 -0.440918 -0.396567 -0.265297 -0.262740 0.179211 -0.200112 -0.280072 -0.270225 -0.190241 0.233629 -0.163303 -0.178579 -0.408990 -0.413057 -0.138983 -0.127943 -0.061528 0.288204 -0.175236 0.353391 0.357118 -0.154155 0.384597 0.406676 -0.308010 -0.125004 -0.134687 0.136672 0.216510 0.137072 0.113076 0.121675 0.122349 0.124091 0.120810 0.127553 0.107181 0.107967 0.122861 0.125234 0.111147 0.120450 0.166774
qa: 0.8493 -0.4379 -0.4409 -0.3966 -0.2653 -0.2627 0.1792 -0.2001 -0.2801 -0.2702 -0.1902 0.2336 -0.1633 -0.1786 -0.4090 -0.4131 -0.1390 -0.1279 -0.0615 0.2882 -0.1752 0.3534 0.3571 -0.1542 0.3846 0.4067 -0.3080 -0.1250 -0.1347 0.1367 0.2165 0.1371 0.1131 0.1217 0.1223 0.1241 0.1208 0.1276 0.1072 0.1080 0.1229 0.1252 0.1111 0.1204 0.1668
va: 5.9105 2.0676 2.0555 2.1164 2.1467 2.1611 3.3477 3.0860 2.9075 2.9054 2.9454 3.3685 3.1639 2.8238 2.9728 2.9655 4.0658 3.7884 4.0960 4.0442 3.8645 4.3860 4.2499 3.8847 4.0550 4.0174 3.9432 3.8780 3.8639 1.0154 1.0526 0.9985 1.0092 0.9943 1.0010 0.9924 0.9929 1.0224 0.9971 0.9970 0.9941 0.9954 0.9962 0.9929 1.0369
dispcorr: -0.025474095 hartree
energy: -1826.990612090939
dipole: 9.68033 -8.01561 1.66472 -4.40358 2.97711 -1.42647 4.90618 -3.80644 1.09974
magnitude: 2.45266 au
magnitude: 6.23417 debye
