program: Orca
programVersion: 4.2.1
elementType: S O O O O O N N N N N N N N N N C C C C C C C C C C C C C H H H H H H H H H H H H H H H H
charge: 0
multiplicity: 1
keywords: wb97x-d3
keywords: def2-TZVPP
keywords: def2/J RIJCOSX GRIDX6 NOFINALGRIDX
keywords: grid4 nofinalgrid
keywords: scfconv7
keywords: smallprint printgap noloewdin
keywords: NOSOSCF
formula: C13H16N10O5S
InChI: InChI=1S/C13H16N10O5S/c1-22-11(7(6-14-22)10-18-21-23(2)19-10)29(25,26)20-13(24)17-12-15-8(27-3)5-9(16-12)28-4/h5-6,17,20H,1-4H3
45 atoms
S  -2.025063 0.827995 -1.314213
O  -2.675396 2.042647 -1.732912
O  -1.885182 -0.290781 -2.213112
O  -1.033484 2.689088 0.770466
O  5.549232 1.12113 1.128995
O  3.108003 -1.004799 -2.199391
N  -3.832244 0.888112 0.778713
N  -0.472941 1.156853 -0.816474
N  -4.282679 0.18625 1.802237
N  -1.697738 -3.163758 1.15202
N  -0.433863 -1.804697 -0.029115
N  -0.577168 -3.71637 0.766798
N  1.127075 2.06608 0.604149
N  0.18771 -2.928946 0.063256
N  3.334814 1.600125 0.863888
N  2.09757 0.512323 -0.825866
C  -2.81142 0.259671 0.156616
C  -2.591721 -0.92734 0.836158
C  -3.553151 -0.907446 1.854359
C  -1.593814 -1.952421 0.636776
C  -4.438211 2.177956 0.506787
C  -0.200277 2.018033 0.21224
C  2.228104 1.353647 0.184006
C  -0.218101 -5.074401 1.086677
C  4.410144 0.924813 0.486882
C  3.184391 -0.157939 -1.193192
C  4.405519 0.008998 -0.558096
C  5.567636 2.044125 2.205371
C  1.861746 -1.166861 -2.867771
H  -3.722845 -1.649412 2.617949
H  0.266908 0.512778 -1.117399
H  -3.686206 2.960168 0.524926
H  -5.16473 2.341377 1.29505
H  -4.938387 2.179682 -0.457326
H  -0.958122 -5.758932 0.679497
H  -0.166099 -5.19976 2.16548
H  0.752433 -5.276313 0.645667
H  5.289841 -0.532934 -0.855573
H  6.58906 2.041117 2.576699
H  4.889283 1.746774 3.005726
H  5.30167 3.050791 1.881706
H  1.087235 -1.541704 -2.200006
H  2.045347 -1.896293 -3.651768
H  1.523315 -0.233788 -3.320367
H  1.300892 2.693332 1.37492
totalener: -1826.96510963 hartree
nucrepener: 3207.57383023 hartree
electener: -5034.53893986 hartree
oneelecener: -8879.88138802 hartree
twoeener: 3845.34244816 hartree
kineticenergy: 1820.62334461 hartree
xcener: -150.532215792545 hartree
chargesum: -0.0000000
charge: 0.849619 -0.438033 -0.441305 -0.396044 -0.265355 -0.262834 0.178811 -0.199570 -0.280040 -0.270024 -0.190449 0.234207 -0.163355 -0.179187 -0.408827 -0.412752 -0.137866 -0.127382 -0.061648 0.287480 -0.175191 0.352567 0.356916 -0.154253 0.384671 0.406953 -0.308219 -0.124998 -0.134429 0.136757 0.215940 0.137247 0.113237 0.121398 0.124336 0.120665 0.122369 0.127456 0.122814 0.107199 0.107880 0.120267 0.125246 0.111026 0.166704
qa: 0.8496 -0.4380 -0.4413 -0.3960 -0.2654 -0.2628 0.1788 -0.1996 -0.2800 -0.2700 -0.1904 0.2342 -0.1634 -0.1792 -0.4088 -0.4128 -0.1379 -0.1274 -0.0616 0.2875 -0.1752 0.3526 0.3569 -0.1543 0.3847 0.4070 -0.3082 -0.1250 -0.1344 0.1368 0.2159 0.1372 0.1132 0.1214 0.1243 0.1207 0.1224 0.1275 0.1228 0.1072 0.1079 0.1203 0.1252 0.1110 0.1667
va: 5.9089 2.0673 2.0549 2.1170 2.1465 2.1609 3.3483 3.0860 2.9070 2.9054 2.9437 3.3674 3.1638 2.8227 2.9731 2.9653 4.0648 3.7887 4.0958 4.0433 3.8645 4.3874 4.2505 3.8847 4.0547 4.0169 3.9430 3.8782 3.8640 1.0152 1.0534 0.9981 1.0091 0.9947 0.9925 0.9929 1.0010 1.0224 0.9941 0.9970 0.9970 0.9931 0.9954 0.9963 1.0369
dispcorr: -0.025499636 hartree
energy: -1826.990609265402
dipole: 9.63371 -7.98420 1.64952 -4.44995 3.01399 -1.43596 4.88756 -3.78990 1.09766
magnitude: 2.44699 au
magnitude: 6.21974 debye
