program: Orca
programVersion: 4.2.1
elementType: S O O O O O N N N N N N N N N N C C C C C C C C C C C C C H H H H H H H H H H H H H H H H
charge: 0
multiplicity: 1
keywords: wb97x-d3
keywords: def2-TZVPP
keywords: def2/J RIJCOSX GRIDX6 NOFINALGRIDX
keywords: grid4 nofinalgrid
keywords: scfconv7
keywords: smallprint printgap noloewdin
keywords: NOSOSCF
formula: C13H16N10O5S
InChI: InChI=1S/C13H16N10O5S/c1-22-11(7(6-14-22)10-18-21-23(2)19-10)29(25,26)20-13(24)17-12-15-8(27-3)5-9(16-12)28-4/h5-6,17,20H,1-4H3
45 atoms
S  -2.033433 0.697147 -1.328355
O  -2.679872 1.883958 -1.825374
O  -1.892468 -0.476673 -2.153418
O  -1.042989 2.695326 0.625721
O  3.129094 -1.122101 -2.148712
O  5.607731 1.417218 0.844653
N  -3.838458 0.905105 0.756526
N  -0.483066 1.053361 -0.847061
N  -4.293623 0.273874 1.823109
N  -1.744768 -3.130447 1.400445
N  -0.472983 -1.879761 0.112166
N  -0.634926 -3.725337 1.04933
N  1.126219 2.10514 0.459455
N  0.134586 -3.002642 0.283879
N  2.103927 0.466559 -0.868958
N  3.36194 1.764127 0.649494
C  -2.825463 0.227872 0.17386
C  -2.615328 -0.915171 0.927355
C  -3.574966 -0.821474 1.943292
C  -1.629463 -1.962184 0.795574
C  -4.433012 2.181141 0.405271
C  -0.207346 1.998445 0.10407
C  2.239355 1.405257 0.050753
C  -0.288332 -5.057678 1.474834
C  3.206355 -0.182533 -1.228807
C  4.451976 1.10688 0.282762
C  4.445435 0.099094 -0.673524
C  1.864414 -1.408147 -2.736204
C  5.630293 2.448233 1.81817
H  -3.750078 -1.512242 2.752284
H  0.261331 0.401563 -1.117877
H  -5.147544 2.40551 1.189634
H  -4.94551 2.124116 -0.550821
H  -3.67227 2.953819 0.362395
H  -0.197211 -5.089588 2.558104
H  0.660699 -5.318833 1.018381
H  -1.056426 -5.758405 1.157155
H  5.341131 -0.426317 -0.966588
H  1.141695 -1.753342 -1.998103
H  2.051446 -2.199856 -3.456376
H  1.456837 -0.540648 -3.25717
H  6.666437 2.528417 2.136088
H  5.003903 2.208075 2.677792
H  5.301925 3.402685 1.405661
H  1.304996 2.800753 1.167904
totalener: -1826.96529736 hartree
nucrepener: 3197.62550129 hartree
electener: -5024.59079865 hartree
oneelecener: -8859.99313266 hartree
twoeener: 3835.40233401 hartree
kineticenergy: 1820.62232307 hartree
xcener: -150.531992985354 hartree
chargesum: 0.0000000
charge: 0.847474 -0.437705 -0.440150 -0.398275 -0.263108 -0.265409 0.179057 -0.200229 -0.280201 -0.269958 -0.188388 0.231688 -0.162675 -0.177863 -0.415114 -0.410053 -0.137657 -0.127442 -0.061966 0.287275 -0.176621 0.355781 0.358604 -0.154078 0.404626 0.383803 -0.306068 -0.135123 -0.125851 0.137181 0.217372 0.112877 0.121770 0.138098 0.120557 0.122293 0.124264 0.127948 0.122489 0.124811 0.110482 0.123462 0.107187 0.108218 0.166619
qa: 0.8475 -0.4377 -0.4401 -0.3983 -0.2631 -0.2654 0.1791 -0.2002 -0.2802 -0.2700 -0.1884 0.2317 -0.1627 -0.1779 -0.4151 -0.4101 -0.1377 -0.1274 -0.0620 0.2873 -0.1766 0.3558 0.3586 -0.1541 0.4046 0.3838 -0.3061 -0.1351 -0.1259 0.1372 0.2174 0.1129 0.1218 0.1381 0.1206 0.1223 0.1243 0.1279 0.1225 0.1248 0.1105 0.1235 0.1072 0.1082 0.1666
va: 5.9126 2.0677 2.0562 2.1151 2.1624 2.1470 3.3471 3.0871 2.9074 2.9052 2.9487 3.3724 3.1634 2.8275 2.9673 2.9722 4.0668 3.7900 4.0962 4.0447 3.8636 4.3838 4.2480 3.8849 4.0205 4.0563 3.9410 3.8648 3.8777 1.0152 1.0497 1.0091 0.9942 0.9980 0.9924 1.0009 0.9930 1.0223 0.9915 0.9955 0.9974 0.9940 0.9970 0.9969 1.0371
dispcorr: -0.025258549 hartree
energy: -1826.990555907980
dipole: 9.71072 -8.05093 1.65979 -3.73520 2.42929 -1.30591 4.91730 -3.75741 1.15988
magnitude: 2.40949 au
magnitude: 6.12444 debye
