program: Orca
programVersion: 4.2.1
elementType: S O O O O O N N N N N N N N N N C C C C C C C C C C C C C H H H H H H H H H H H H H H H H
charge: 0
multiplicity: 1
keywords: wb97x-d3
keywords: def2-TZVPP
keywords: def2/J RIJCOSX GRIDX6 NOFINALGRIDX
keywords: grid4 nofinalgrid
keywords: scfconv7
keywords: smallprint printgap noloewdin
keywords: NOSOSCF
formula: C13H16N10O5S
InChI: InChI=1S/C13H16N10O5S/c1-22-11(7(6-14-22)10-18-21-23(2)19-10)29(25,26)20-13(24)17-12-15-8(27-3)5-9(16-12)28-4/h5-6,17,20H,1-4H3
45 atoms
S  -2.016048 0.821438 -1.312302
O  -2.65248 2.039523 -1.741741
O  -1.880849 -0.303295 -2.204316
O  -1.020572 2.688869 0.763058
O  5.579275 1.187886 1.082509
O  3.126054 -1.024445 -2.179834
N  -3.827834 0.91505 0.775844
N  -0.463438 1.139107 -0.807612
N  -4.292172 0.221335 1.7984
N  -1.771568 -3.178707 1.133536
N  -0.467233 -1.829143 -0.013753
N  -0.657992 -3.749361 0.750909
N  1.139572 2.065995 0.598726
N  0.129451 -2.968421 0.067566
N  3.355354 1.632264 0.83799
N  2.110847 0.498843 -0.816447
C  -2.815996 0.269085 0.15665
C  -2.617496 -0.920784 0.837266
C  -3.580252 -0.88395 1.853557
C  -1.637349 -1.962807 0.636505
C  -4.413459 2.213466 0.499722
C  -0.188467 2.011447 0.210816
C  2.24357 1.359801 0.176528
C  -0.320705 -5.119491 1.052963
C  4.434876 0.964887 0.458923
C  3.202485 -0.161789 -1.187177
C  4.429182 0.031641 -0.570421
C  5.600226 2.133933 2.138666
C  1.875137 -1.211652 -2.832705
H  -3.763965 -1.622146 2.617509
H  0.273065 0.488525 -1.101815
H  -5.137083 2.390929 1.287893
H  -4.913909 2.219198 -0.46444
H  -3.64904 2.983788 0.5148
H  -1.14917 -5.554215 1.600833
H  0.580994 -5.157063 1.659482
H  -0.159127 -5.673504 0.131751
H  5.316933 -0.502846 -0.871161
H  6.626323 2.150977 2.496451
H  4.935823 1.846033 2.953995
H  5.318121 3.130156 1.796769
H  1.517723 -0.288432 -3.290818
H  1.113965 -1.590986 -2.152333
H  2.061071 -1.94627 -3.611301
H  1.31547 2.705134 1.359159
totalener: -1826.96438356 hartree
nucrepener: 3202.80446762 hartree
electener: -5029.76885118 hartree
oneelecener: -8870.37197410 hartree
twoeener: 3840.60312292 hartree
kineticenergy: 1820.62194618 hartree
xcener: -150.531790511720 hartree
chargesum: 0.0000000
charge: 0.848735 -0.437839 -0.441350 -0.397800 -0.265368 -0.262949 0.178730 -0.199695 -0.279822 -0.280670 -0.187278 0.234295 -0.163139 -0.167974 -0.409275 -0.414106 -0.138314 -0.123023 -0.061717 0.280474 -0.176135 0.354660 0.358011 -0.155711 0.384228 0.406328 -0.307634 -0.125265 -0.134527 0.136254 0.216357 0.112938 0.121499 0.138054 0.123196 0.122988 0.123919 0.127690 0.122907 0.107297 0.107985 0.110926 0.120281 0.125146 0.166688
qa: 0.8487 -0.4378 -0.4413 -0.3978 -0.2654 -0.2629 0.1787 -0.1997 -0.2798 -0.2807 -0.1873 0.2343 -0.1631 -0.1680 -0.4093 -0.4141 -0.1383 -0.1230 -0.0617 0.2805 -0.1761 0.3547 0.3580 -0.1557 0.3842 0.4063 -0.3076 -0.1253 -0.1345 0.1363 0.2164 0.1129 0.1215 0.1381 0.1232 0.1230 0.1239 0.1277 0.1229 0.1073 0.1080 0.1109 0.1203 0.1251 0.1667
va: 5.9103 2.0676 2.0549 2.1154 2.1466 2.1616 3.3486 3.0875 2.9068 2.9297 2.9363 3.3572 3.1637 2.7867 2.9727 2.9655 4.0673 3.7838 4.0952 4.0450 3.8639 4.3850 4.2490 3.8785 4.0555 4.0178 3.9423 3.8781 3.8648 1.0152 1.0517 1.0091 0.9945 0.9980 1.0013 0.9924 0.9934 1.0224 0.9941 0.9970 0.9970 0.9966 0.9930 0.9954 1.0370
dispcorr: -0.025385513 hartree
energy: -1826.989769070546
dipole: 9.57692 -7.96384 1.61308 -4.35955 2.91026 -1.44929 4.75568 -3.66476 1.09092
magnitude: 2.42746 au
magnitude: 6.17012 debye
