program: Orca
programVersion: 4.2.1
elementType: S O O O O O N N N N N N N N N N C C C C C C C C C C C C C H H H H H H H H H H H H H H H H
charge: 0
multiplicity: 1
keywords: wb97x-d3
keywords: def2-TZVPP
keywords: def2/J RIJCOSX GRIDX6 NOFINALGRIDX
keywords: grid4 nofinalgrid
keywords: scfconv7
keywords: smallprint printgap noloewdin
keywords: NOSOSCF
formula: C13H16N10O5S
InChI: InChI=1S/C13H16N10O5S/c1-22-11(7(6-14-22)10-18-21-23(2)19-10)29(25,26)20-13(24)17-12-15-8(27-3)5-9(16-12)28-4/h5-6,17,20H,1-4H3
45 atoms
S  -2.008667 0.818893 -1.295004
O  -2.636683 2.042354 -1.721631
O  -1.877238 -0.304014 -2.189818
O  -1.006376 2.681652 0.782423
O  5.609771 1.239383 1.030074
O  3.135444 -1.022561 -2.181773
N  -3.824679 0.918705 0.788608
N  -0.456193 1.126109 -0.784955
N  -4.29923 0.223791 1.805892
N  -1.811581 -3.196523 1.132328
N  -0.490159 -1.856438 -0.007672
N  -0.70448 -3.777566 0.749804
N  1.153669 2.061836 0.607544
N  0.094029 -3.001616 0.071002
N  3.377142 1.654648 0.816741
N  2.121302 0.495301 -0.811231
C  -2.817026 0.266593 0.169364
C  -2.632258 -0.928849 0.844191
C  -3.598993 -0.889038 1.856641
C  -1.662524 -1.979863 0.641616
C  -4.398465 2.223632 0.517549
C  -0.176381 2.003769 0.227684
C  2.258955 1.364756 0.173788
C  -0.391444 -5.151281 1.050708
C  4.459066 0.998431 0.425261
C  3.215936 -0.152752 -1.195689
C  4.449424 0.059766 -0.59909
C  5.634759 2.192255 2.080048
C  1.876576 -1.232454 -2.812179
H  -3.792816 -1.629968 2.615445
H  0.27849 0.475253 -1.082484
H  -3.62667 2.986372 0.531747
H  -5.117374 2.406127 1.308769
H  -4.902439 2.23662 -0.444686
H  -1.170673 -5.801286 0.660222
H  -0.313204 -5.288367 2.126874
H  0.557074 -5.388721 0.58019
H  5.339202 -0.464881 -0.910951
H  4.98657 1.901058 2.907168
H  5.334823 3.182672 1.736475
H  6.665863 2.224499 2.422013
H  2.060722 -1.967744 -3.590581
H  1.496462 -0.317278 -3.268245
H  1.133336 -1.620344 -2.116896
H  1.333238 2.706095 1.362814
totalener: -1826.96530807 hartree
nucrepener: 3198.81776494 hartree
electener: -5025.78307301 hartree
oneelecener: -8862.37791228 hartree
twoeener: 3836.59483927 hartree
kineticenergy: 1820.62118465 hartree
xcener: -150.531640980526 hartree
chargesum: -0.0000000
charge: 0.848419 -0.437831 -0.440861 -0.398377 -0.265323 -0.263175 0.178942 -0.200121 -0.279814 -0.269637 -0.189069 0.232767 -0.163138 -0.178500 -0.409714 -0.415171 -0.136965 -0.125992 -0.062079 0.285641 -0.176430 0.355767 0.358938 -0.154411 0.384356 0.405515 -0.307152 -0.125412 -0.135163 0.136645 0.217294 0.138090 0.112977 0.121622 0.124987 0.120033 0.122187 0.127822 0.107376 0.108000 0.123037 0.125056 0.110723 0.121423 0.166718
qa: 0.8484 -0.4378 -0.4409 -0.3984 -0.2653 -0.2632 0.1789 -0.2001 -0.2798 -0.2696 -0.1891 0.2328 -0.1631 -0.1785 -0.4097 -0.4152 -0.1370 -0.1260 -0.0621 0.2856 -0.1764 0.3558 0.3589 -0.1544 0.3844 0.4055 -0.3072 -0.1254 -0.1352 0.1366 0.2173 0.1381 0.1130 0.1216 0.1250 0.1200 0.1222 0.1278 0.1074 0.1080 0.1230 0.1251 0.1107 0.1214 0.1667
va: 5.9111 2.0677 2.0554 2.1149 2.1469 2.1619 3.3483 3.0883 2.9064 2.9043 2.9460 3.3699 3.1639 2.8261 2.9726 2.9659 4.0647 3.7901 4.0959 4.0411 3.8639 4.3840 4.2477 3.8850 4.0557 4.0191 3.9414 3.8780 3.8655 1.0152 1.0496 0.9981 1.0091 0.9943 0.9929 0.9924 1.0011 1.0223 0.9970 0.9970 0.9941 0.9955 0.9969 0.9920 1.0370
dispcorr: -0.025289865 hartree
energy: -1826.990597936607
dipole: 9.54974 -7.93640 1.61334 -4.30167 2.87838 -1.42329 4.65626 -3.59191 1.06436
magnitude: 2.40031 au
magnitude: 6.10110 debye
