program: Orca
programVersion: 4.2.1
elementType: S O O O O O N N N N N N N N N N C C C C C C C C C C C C C H H H H H H H H H H H H H H H H
charge: 0
multiplicity: 1
keywords: wb97x-d3
keywords: def2-TZVPP
keywords: def2/J RIJCOSX GRIDX6 NOFINALGRIDX
keywords: grid4 nofinalgrid
keywords: scfconv7
keywords: smallprint printgap noloewdin
keywords: NOSOSCF
formula: C13H16N10O5S
InChI: InChI=1S/C13H16N10O5S/c1-22-11(7(6-14-22)10-18-21-23(2)19-10)29(25,26)20-13(24)17-12-15-8(27-3)5-9(16-12)28-4/h5-6,17,20H,1-4H3
45 atoms
S  -1.784049 0.587711 1.606888
O  -1.543089 -0.657486 2.292919
O  -2.324066 1.729186 2.298803
O  -1.042389 2.772566 -0.259414
O  5.523587 1.609978 -1.448606
O  3.426394 -1.312653 1.485781
N  -3.850534 1.013522 -0.184413
N  -0.314009 0.975405 0.931257
N  -4.489575 0.463005 -1.199672
N  -2.142513 -3.129392 -1.186667
N  -0.560144 -1.925751 -0.242759
N  -1.016313 -3.780764 -1.057549
N  1.123097 2.1803 -0.443849
N  -0.06443 -3.086964 -0.497573
N  3.318489 1.897827 -0.942083
N  2.252876 0.404786 0.544154
C  -2.804047 0.256686 0.211275
C  -2.770225 -0.853701 -0.615187
C  -3.858904 -0.659164 -1.473838
C  -1.838238 -1.956532 -0.662897
C  -4.328593 2.285599 0.324422
C  -0.153618 2.024321 0.067137
C  2.276561 1.451432 -0.261848
C  -0.84834 -5.150202 -1.47215
C  4.444384 1.216063 -0.794551
C  3.391071 -0.267086 0.685149
C  4.553042 0.097259 0.022006
C  5.430922 2.758101 -2.276014
C  2.243457 -1.683859 2.185089
H  -4.187592 -1.296211 -2.279157
H  0.450822 0.299671 1.029107
H  -4.748327 2.173095 1.320549
H  -5.101576 2.613504 -0.362223
H  -3.522053 3.010374 0.350805
H  -1.09582 -5.248992 -2.526085
H  -1.496844 -5.798725 -0.887469
H  0.188534 -5.425099 -1.309587
H  5.477274 -0.447666 0.136364
H  5.16123 3.647643 -1.705898
H  4.702011 2.624425 -3.075837
H  6.420289 2.890064 -2.705945
H  1.431738 -1.938124 1.505096
H  1.910732 -0.894601 2.860766
H  2.513321 -2.560195 2.76781
H  1.213713 2.957175 -1.08102
totalener: -1826.96567427 hartree
nucrepener: 3186.42933417 hartree
electener: -5013.39500844 hartree
oneelecener: -8837.60043007 hartree
twoeener: 3824.20542164 hartree
kineticenergy: 1820.62057885 hartree
xcener: -150.531429683287 hartree
chargesum: -0.0000000
charge: 0.848085 -0.442394 -0.436471 -0.403746 -0.265001 -0.263512 0.179237 -0.202577 -0.278809 -0.269886 -0.190380 0.229826 -0.163054 -0.173866 -0.410533 -0.418216 -0.134373 -0.117227 -0.063193 0.276239 -0.179147 0.361120 0.362347 -0.153020 0.384073 0.403749 -0.304888 -0.124878 -0.136307 0.136240 0.220135 0.121808 0.112575 0.140153 0.121400 0.123498 0.121594 0.127337 0.107572 0.107073 0.123405 0.120914 0.112408 0.123809 0.166882
qa: 0.8481 -0.4424 -0.4365 -0.4037 -0.2650 -0.2635 0.1792 -0.2026 -0.2788 -0.2699 -0.1904 0.2298 -0.1631 -0.1739 -0.4105 -0.4182 -0.1344 -0.1172 -0.0632 0.2762 -0.1791 0.3611 0.3623 -0.1530 0.3841 0.4037 -0.3049 -0.1249 -0.1363 0.1362 0.2201 0.1218 0.1126 0.1402 0.1214 0.1235 0.1216 0.1273 0.1076 0.1071 0.1234 0.1209 0.1124 0.1238 0.1669
va: 5.9122 2.0541 2.0688 2.1092 2.1474 2.1630 3.3487 3.0925 2.9044 2.8981 2.9444 3.3732 3.1649 2.8260 2.9716 2.9681 4.0570 3.7964 4.0938 4.0386 3.8635 4.3785 4.2438 3.8848 4.0571 4.0219 3.9393 3.8782 3.8688 1.0149 1.0443 0.9932 1.0090 0.9990 0.9938 0.9918 1.0010 1.0225 0.9971 0.9970 0.9939 0.9899 0.9975 0.9962 1.0370
dispcorr: -0.025031741 hartree
energy: -1826.990706009864
dipole: 8.63219 -7.24570 1.38650 -3.38203 2.14846 -1.23357 -5.83789 4.49409 -1.34381
magnitude: 2.29127 au
magnitude: 5.82393 debye
