program: Orca
programVersion: 4.2.1
elementType: S O O O O O N N N N N N N N N N C C C C C C C C C C C C C H H H H H H H H H H H H H H H H
charge: 0
multiplicity: 1
keywords: wb97x-d3
keywords: def2-TZVPP
keywords: def2/J RIJCOSX GRIDX6 NOFINALGRIDX
keywords: grid4 nofinalgrid
keywords: scfconv7
keywords: smallprint printgap noloewdin
keywords: NOSOSCF
formula: C13H16N10O5S
InChI: InChI=1S/C13H16N10O5S/c1-22-11(7(6-14-22)10-18-21-23(2)19-10)29(25,26)20-13(24)17-12-15-8(27-3)5-9(16-12)28-4/h5-6,17,20H,1-4H3
45 atoms
S  -1.817213 0.626067 1.596652
O  -1.583851 -0.604836 2.310559
O  -2.378541 1.776534 2.255899
O  -1.054676 2.772384 -0.303255
O  5.49116 1.503102 -1.492133
O  3.391452 -1.277859 1.575114
N  -3.852432 1.000714 -0.241581
N  -0.335832 1.010168 0.94431
N  -4.462033 0.43026 -1.264066
N  -2.059074 -3.120853 -1.18212
N  -0.524471 -1.896102 -0.188184
N  -0.92774 -3.755753 -1.0197
N  1.109901 2.168412 -0.461406
N  -0.00384 -3.049239 -0.429738
N  3.296164 1.839566 -0.971772
N  2.229125 0.418088 0.581976
C  -2.804444 0.263103 0.184866
C  -2.737439 -0.855661 -0.628314
C  -3.810162 -0.685755 -1.512075
C  -1.788536 -1.944688 -0.647251
C  -4.356081 2.273364 0.240284
C  -0.169189 2.032136 0.04938
C  2.256475 1.432547 -0.263987
C  -0.725773 -5.120632 -1.434147
C  4.414841 1.148966 -0.81104
C  3.359973 -0.263232 0.735495
C  4.518707 0.060431 0.046045
C  5.40211 2.617095 -2.365255
C  2.213306 -1.605167 2.303661
H  -4.112362 -1.336215 -2.317024
H  0.427722 0.336226 1.064213
H  -3.560352 3.010096 0.267034
H  -4.788965 2.170592 1.231767
H  -5.123261 2.579408 -0.462734
H  0.307857 -5.382576 -1.233763
H  -0.931788 -5.217269 -2.497184
H  -1.387204 -5.780601 -0.877539
H  5.437108 -0.492108 0.17041
H  6.386997 2.717432 -2.813637
H  5.152231 3.533201 -1.8292
H  4.660299 2.460436 -3.148895
H  1.39014 -1.878379 1.645045
H  1.898186 -0.784276 2.9494
H  2.480618 -2.459332 2.919573
H  1.204219 2.922524 -1.124847
totalener: -1826.96560655 hartree
nucrepener: 3191.79643727 hartree
electener: -5018.76204382 hartree
oneelecener: -8848.33291001 hartree
twoeener: 3829.57086619 hartree
kineticenergy: 1820.62119069 hartree
xcener: -150.531588558348 hartree
chargesum: 0.0000000
charge: 0.848888 -0.442214 -0.436594 -0.402530 -0.265093 -0.263174 0.179522 -0.201619 -0.279213 -0.269830 -0.190417 0.231195 -0.163048 -0.175735 -0.410290 -0.416675 -0.135462 -0.119556 -0.063112 0.278903 -0.178076 0.359384 0.361247 -0.153147 0.384250 0.404586 -0.305804 -0.124908 -0.135845 0.136226 0.219048 0.139444 0.121393 0.112800 0.121423 0.121432 0.123800 0.127134 0.123308 0.107562 0.107080 0.120648 0.112199 0.124088 0.166780
qa: 0.8489 -0.4422 -0.4366 -0.4025 -0.2651 -0.2632 0.1795 -0.2016 -0.2792 -0.2698 -0.1904 0.2312 -0.1630 -0.1757 -0.4103 -0.4167 -0.1355 -0.1196 -0.0631 0.2789 -0.1781 0.3594 0.3612 -0.1531 0.3842 0.4046 -0.3058 -0.1249 -0.1358 0.1362 0.2190 0.1394 0.1214 0.1128 0.1214 0.1214 0.1238 0.1271 0.1233 0.1076 0.1071 0.1206 0.1122 0.1241 0.1668
va: 5.9113 2.0543 2.0685 2.1102 2.1472 2.1625 3.3479 3.0914 2.9051 2.8995 2.9439 3.3712 3.1647 2.8256 2.9718 2.9676 4.0578 3.7943 4.0940 4.0385 3.8639 4.3799 4.2451 3.8846 4.0570 4.0202 3.9406 3.8783 3.8671 1.0150 1.0465 0.9990 0.9935 1.0090 1.0011 0.9936 0.9918 1.0225 0.9940 0.9971 0.9970 0.9910 0.9971 0.9960 1.0371
dispcorr: -0.025143181 hartree
energy: -1826.990749733522
dipole: 8.75943 -7.33384 1.42559 -3.57450 2.30781 -1.26669 -5.90401 4.56335 -1.34066
magnitude: 2.33113 au
magnitude: 5.92527 debye
