program: Gaussian 09
title: 000074066
version: EM64L-G09RevD.01
frameworkgroup: C1[X(C8H10N2O2)]
method: RPBEPBE
basis: SDD
operation: Freq
keyword: #p
keyword: freq=noraman
keyword: PBEPBE/SDD
title: #p freq=noraman PBEPBE/SDD
converged: NO YES NO NO
title: Mulliken charges:
elementType: O O N N C C C C C C C C H H H H H H H H H H
charge: -0.266055 -0.293562 -0.472883 -0.663600 0.484882 0.321598 -0.452276 -0.320643 -0.329198 -0.350300 0.261739 -0.538250 0.208743 0.309693 0.238515 0.248847 0.286351 0.217285 0.217283 0.244131 0.345722 0.301978
chargesum: 0.00000
title: Mulliken charges with hydrogens summed into heavy atoms:
elementType: O O N N C C C C C C C C
charge: -0.266055 -0.293562 -0.186532 -0.015901 0.484882 0.321598 -0.243533 -0.010951 -0.090684 -0.101452 0.261739 0.140450
polarizability: 1.81317969e+02 -1.60851792e+00 1.06736390e+02 -1.30224251e-02 -5.90098379e-04 4.94125515e+01
1716.lowfreq: -4.8639 -0.0013 -0.0009 -0.0007 6.1646 15.1679 47.7876 52.5150 98.5571
frequency: 47.7831 52.4985 98.5535 139.8662 161.1144 223.3875 238.1238 271.7010 318.0531 345.0489 375.4778 414.5718 458.9311 481.8198 522.1771 523.2863 581.0142 613.9002 645.7107 707.4647 720.6379 748.7245 795.1321 832.2625 851.5979 910.6710 973.6708 985.8266 989.4564 1005.1741 1039.3426 1111.3781 1118.8107 1157.0814 1180.8484 1220.0885 1272.6725 1281.8052 1316.3190 1381.1339 1425.6973 1436.3268 1465.4217 1474.8807 1501.6559 1515.7171 1588.6688 1609.0801 1634.7048 1657.5086 2951.1623 3034.3804 3106.6702 3123.1286 3158.9989 3160.9327 3191.8768 3532.5296 3544.7308 3699.5531
redmass: 4.7346 3.7141 3.5078 4.9903 3.0010 3.9844 1.1269 1.3733 4.9451 5.4733 4.7020 3.0430 3.8647 1.1468 4.0004 2.2471 1.2120 5.8225 5.4655 9.2616 3.7544 5.8281 1.4023 5.0535 1.4774 1.3880 4.3248 1.3016 7.4052 2.6276 1.9265 1.2616 1.3243 1.3332 1.2436 2.3767 2.1884 2.3170 1.6355 6.3077 4.1918 1.1706 1.0503 1.0736 2.3219 2.6700 3.5217 1.5186 5.7444 3.5745 1.0337 1.1034 1.0893 1.0986 1.0932 1.0908 1.0956 1.0704 1.0510 1.1040
irintensity: 0.9017 14.5766 3.2772 5.3302 6.2198 9.7789 3.2531 18.7336 1.4855 0.4108 21.3140 0.9321 2.8779 312.0915 30.0629 17.6579 67.9391 3.2635 0.6452 23.4440 0.8544 7.8927 47.9401 3.9723 70.2676 2.1427 0.4949 2.6862 37.9516 28.2739 32.5812 0.2306 20.2554 0.7246 53.9297 227.6764 7.3972 90.6019 57.0621 235.5858 23.6401 13.3484 12.9738 105.5701 31.2196 750.4276 93.4662 20.0206 1.0464 258.1140 77.3573 56.2081 28.4818 24.1862 14.6245 3.1661 7.7470 16.6660 49.1345 41.1028
temp: 298.150 k
press: 1.00000 atm
elementType: 8 8 7 7 6 6 6 6 6 6 6 6 1 1 1 1 1 1 1 1 1 1
symmnumber: 1
zpe: 454142.8 jmol-1
zpe.correction: 0.172974 hartree
zpe.thermalcorrener: 0.184697 hartree
zpe.thermalcorrenthalpy: 0.185641 hartree
zpe.thermalcorrgfe: 0.134883 hartree
zpe.sumelectzpe: -569.923154 hartree
zpe.sumelectthermal: -569.911431 hartree
zpe.sumelectthermalent: -569.910487 hartree
zpe.sumelectthermalfe: -569.961245 hartree
dipole: 0.4216 -5.8045 0.0001
dipole: 5.8198
quadrupole: -47.7680 -65.7699 -75.4826
quadrupole: -8.3006 -0.0040 0.0005
quadrupole: 15.2388 -2.7630 -12.4758 -8.3006 -0.0040 0.0005
hfenergy: -570.096128 hartree
pointgroup: C01 [X(C8H10N2O2)]
dipole: -0.1510534 2.2846953 0.0000342 debye
dipolederiv: -1.8769028 -0.0376266 -0.0001919 0.1278535 -0.3163161 0.0000167 -0.0001546 -0.0000252 -0.2988008 -0.7961081 -0.0142978 -0.000027 -0.2728833 -1.0271854 -0.0000289 0.0000207 0.0000489 -0.3880008 -1.9893908 -0.1116167 -0.0001247 -0.4943704 -0.3386354 -0.0000218 -0.0001102 0.0000073 -0.3467624 -1.490576 0.3546032 -0.0000681 0.5134779 -0.4166834 0.0000176 0.0000125 -0.0000097 -0.7968112 1.2888797 -0.1556558 0.0001307 -0.3818129 -0.0981108 -0.0000335 0.0001387 -0.0000192 0.0766827 1.4761833 -0.1604127 0.0001497 -0.4817989 -0.0276021 -0.0000743 0.000091 -0.0000215 0.0768028 -0.144428 0.1547907 0.0000151 -0.1844524 0.1028744 -0.0000121 -0.000001 0.000028 -0.2093046 -0.1168494 -0.0907253 0.0000029 0.1927935 0.0250876 0.0000255 -0.0000022 -0.0000129 -0.1614363 -0.2083786 -0.1007256 -0.0000053 0.362943 -0.0059958 0.0000428 0.0000334 -0.0000127 -0.1967088 -0.2746046 0.1053836 -0.0000079 -0.2081596 0.1256036 -0.0000077 -0.0000327 0.0000258 -0.1657386 2.6581679 -0.1232981 0.0001215 0.518124 1.4303658 0.0000379 0.0000273 -0.000045 0.3387107 0.7487784 0.1198677 0.0000565 0.4949639 0.32818 0.0000558 0.0000877 0.0000138 0.3374823 0.026533 0.1021288 -0.0000147 0.0948847 -0.1049644 0.0000024 -0.0000206 0.0000016 0.1652975 0.1682536 -0.0621291 -0.0000084 -0.0394973 0.0773363 -0.0000083 -0.0000098 -0.0000065 0.179749 -0.0149572 -0.0988249 -0.0000223 -0.1142165 0.0019374 -0.0000166 -0.0000193 -0.0000126 0.16773 0.0737048 0.0540758 -0.0000076 0.062998 -0.0431134 -0.0000004 -0.0000067 -0.0000006 0.1641067 0.1114627 -0.0198824 -0.0000175 0.0153248 0.0630055 0.0000066 -0.0000266 -0.0000044 0.3189704 0.0344981 0.0179355 0.0479838 -0.1616918 -0.0363123 -0.1201127 -0.0293536 -0.1149845 -0.0990605 0.0344958 0.0178914 -0.0479179 -0.1617514 -0.0363433 0.1200782 0.0293887 0.1150042 -0.0990492 -0.1432186 0.0623256 -0.0000445 0.1104712 0.0507128 0.0000205 -0.000045 0.0000133 0.1226849 0.2458116 0.0000397 -0.0000023 0.0267973 0.1624063 0.0000039 -0.0000182 0.0000017 0.4036056 0.1886452 -0.013847 -0.0000002 -0.0199972 0.0837529 0.0000081 0.0000005 0.0000103 0.4098507 unknown
polarizability: 181.2939547|-2.0923129|106.7604044|0.013026|0.0005056|49.4125515 unknown
InChI: InChI=1S/C8H10N2O2/c1-12-7-4-2-6(3-5-7)10-8(9)11/h2-5,10H,9H2,1H3
charge 0 multiplicity 1
22 atoms
O  3.473951 -0.674568 0.000595
O  -3.101393 -1.324283 0.00006
N  -2.007995 0.774055 0.000018
N  -4.349983 0.637485 -0.000047
C  -0.637484 0.381964 0.000179
C  2.133366 -0.245676 0.000479
C  0.339143 1.409352 0.000319
C  -0.211744 -0.975923 0.000183
C  1.717845 1.107737 0.000468
C  1.161009 -1.275327 0.000336
C  -3.136534 -0.057664 -0.00003
C  4.507101 0.359995 0.000874
H  0.025319 2.462054 0.000314
H  -0.961443 -1.769105 0.000078
H  2.443825 1.926046 0.000564
H  1.502323 -2.315138 0.000338
H  -2.165447 1.783335 -0.000018
H  4.442297 0.998253 0.904851
H  4.442674 0.998351 -0.903063
H  5.462905 -0.184104 0.001044
H  -5.192621 0.0685 -0.000064
H  -4.437614 1.651163 -0.000079
