program: Orca
programVersion: 4.2.1
elementType: S O O O O O N N N N N N N N N N C C C C C C C C C C C C C H H H H H H H H H H H H H H H H
charge: 0
multiplicity: 1
keywords: wb97x-d3
keywords: def2-TZVPP
keywords: def2/J RIJCOSX GRIDX6 NOFINALGRIDX
keywords: grid4 nofinalgrid
keywords: scfconv7
keywords: smallprint printgap noloewdin
keywords: NOSOSCF
formula: C13H16N10O5S
InChI: InChI=1S/C13H16N10O5S/c1-22-11(7(6-14-22)10-18-21-23(2)19-10)29(25,26)20-13(24)17-12-15-8(27-3)5-9(16-12)28-4/h5-6,17,20H,1-4H3
45 atoms
S  -1.550631 1.668851 1.201782
O  -0.996447 1.26346 2.469466
O  -2.159543 2.963096 1.036564
O  -1.524737 1.878562 -1.75406
O  3.752184 0.103769 1.187371
O  4.654058 -0.400612 -3.338612
N  -3.938973 0.702647 0.195922
N  -0.298079 1.486246 0.122543
N  -4.616462 -0.408637 -0.026125
N  -1.602315 -3.038246 1.475175
N  -0.184467 -1.372655 1.238729
N  -0.365405 -3.384015 1.71961
N  0.617995 1.221821 -1.998337
N  0.492888 -2.411471 1.587407
N  2.177248 0.667451 -0.366161
N  2.633537 0.419175 -2.668613
C  -2.706772 0.443657 0.684389
C  -2.587545 -0.933546 0.774784
C  -3.824901 -1.402331 0.315306
C  -1.471944 -1.758853 1.174824
C  -4.566231 1.969333 -0.131585
C  -0.484344 1.56079 -1.231807
C  1.862841 0.749752 -1.64653
C  0.016822 -4.718578 2.104837
C  3.385835 0.198448 -0.074335
C  3.834925 -0.047222 -2.362663
C  4.285613 -0.188117 -1.05601
C  2.844863 0.523276 2.200654
C  4.20802 -0.26462 -4.677819
H  -4.148761 -2.426029 0.218529
H  0.566525 1.056609 0.46977
H  -3.948765 2.528882 -0.826525
H  -4.736029 2.564095 0.761399
H  -5.516365 1.723803 -0.593036
H  -0.269951 -5.424089 1.328808
H  -0.472276 -4.989924 3.037213
H  1.093722 -4.733508 2.236043
H  5.268014 -0.567541 -0.821204
H  3.365887 0.364848 3.140784
H  1.926703 -0.062598 2.193472
H  2.595395 1.580884 2.104327
H  3.321088 -0.867962 -4.873387
H  5.028955 -0.61606 -5.297215
H  3.983392 0.772863 -4.927019
H  0.450373 1.263955 -2.992255
totalener: -1826.96504987 hartree
nucrepener: 3209.79960774 hartree
electener: -5036.76465761 hartree
oneelecener: -8884.32856866 hartree
twoeener: 3847.56391105 hartree
kineticenergy: 1820.62263596 hartree
xcener: -150.532040981033 hartree
chargesum: 0.0000000
charge: 0.849628 -0.440017 -0.437138 -0.395888 -0.262404 -0.265564 0.180140 -0.201169 -0.280466 -0.270501 -0.190665 0.233426 -0.162831 -0.177864 -0.412467 -0.409175 -0.140416 -0.129511 -0.061775 0.289601 -0.174593 0.351721 0.356598 -0.154261 0.406347 0.384368 -0.306921 -0.135483 -0.125322 0.137406 0.216629 0.136946 0.121424 0.112994 0.120851 0.124120 0.122585 0.127234 0.124448 0.122032 0.111127 0.106788 0.123248 0.108041 0.166730
qa: 0.8496 -0.4400 -0.4371 -0.3959 -0.2624 -0.2656 0.1801 -0.2012 -0.2805 -0.2705 -0.1907 0.2334 -0.1628 -0.1779 -0.4125 -0.4092 -0.1404 -0.1295 -0.0618 0.2896 -0.1746 0.3517 0.3566 -0.1543 0.4063 0.3844 -0.3069 -0.1355 -0.1253 0.1374 0.2166 0.1369 0.1214 0.1130 0.1209 0.1241 0.1226 0.1272 0.1244 0.1220 0.1111 0.1068 0.1232 0.1080 0.1667
va: 5.9094 2.0560 2.0683 2.1170 2.1607 2.1465 3.3466 3.0849 2.9079 2.9067 2.9474 3.3692 3.1629 2.8246 2.9652 2.9730 4.0661 3.7842 4.0961 4.0447 3.8643 4.3871 4.2506 3.8848 4.0181 4.0552 3.9439 3.8629 3.8783 1.0152 1.0526 0.9988 0.9941 1.0088 0.9932 0.9924 1.0006 1.0226 0.9957 0.9924 0.9959 0.9971 0.9941 0.9969 1.0370
dispcorr: -0.025530712 hartree
energy: -1826.990580580153
dipole: 7.88036 -6.53775 1.34261 -7.57108 5.58404 -1.98704 -4.50486 3.92204 -0.58282
magnitude: 2.46792 au
magnitude: 6.27295 debye
