program: Orca
programVersion: 4.2.1
elementType: S O O O O O N N N N N N N N N N C C C C C C C C C C C C C H H H H H H H H H H H H H H H H
charge: 0
multiplicity: 1
keywords: wb97x-d3
keywords: def2-TZVPP
keywords: def2/J RIJCOSX GRIDX6 NOFINALGRIDX
keywords: grid4 nofinalgrid
keywords: scfconv7
keywords: smallprint printgap noloewdin
keywords: NOSOSCF
formula: C13H16N10O5S
InChI: InChI=1S/C13H16N10O5S/c1-22-11(7(6-14-22)10-18-21-23(2)19-10)29(25,26)20-13(24)17-12-15-8(27-3)5-9(16-12)28-4/h5-6,17,20H,1-4H3
45 atoms
S  -1.941726 0.918114 1.392445
O  -1.737778 -0.134908 2.356119
O  -2.569729 2.158358 1.767197
O  -1.098569 2.632014 -0.875798
O  5.440216 1.004754 -1.591303
O  3.246842 -0.856593 2.052677
N  -3.885154 0.828247 -0.573067
N  -0.427361 1.212594 0.772022
N  -4.395246 0.058195 -1.516518
N  -1.727402 -3.219028 -0.849125
N  -0.418559 -1.789304 0.19146
N  -0.579972 -3.73983 -0.499966
N  1.069206 2.014621 -0.816192
N  0.211914 -2.910246 0.120142
N  3.251486 1.516521 -1.201642
N  2.139561 0.561901 0.648307
C  -2.818549 0.2483 0.018495
C  -2.631773 -0.979081 -0.596192
C  -3.659079 -1.031742 -1.546752
C  -1.611247 -1.982244 -0.401024
C  -4.483564 2.130789 -0.34814
C  -0.227794 1.999077 -0.330679
C  2.197039 1.327011 -0.426807
C  -0.219746 -5.107592 -0.773686
C  4.35065 0.86328 -0.855603
C  3.249727 -0.086436 0.983933
C  4.421363 0.026082 0.25108
C  5.382243 1.847073 -2.730531
C  2.053082 -0.961972 2.820797
H  -3.871169 -1.823048 -2.2476
H  0.332438 0.588484 1.065101
H  -3.743204 2.914055 -0.476507
H  -4.912387 2.197796 0.647511
H  -5.267062 2.233972 -1.090863
H  -0.217253 -5.282992 -1.846791
H  -0.931041 -5.779765 -0.300212
H  0.773064 -5.278645 -0.370888
H  5.324723 -0.497938 0.522337
H  4.647616 1.49695 -3.456418
H  6.374286 1.810246 -3.172933
H  5.141662 2.876302 -2.462812
H  2.293307 -1.633265 3.640584
H  1.231503 -1.379912 2.240794
H  1.749171 0.003737 3.22709
H  1.187616 2.584423 -1.640215
totalener: -1826.96507709 hartree
nucrepener: 3209.53383629 hartree
electener: -5036.49891337 hartree
oneelecener: -8883.79953083 hartree
twoeener: 3847.30061746 hartree
kineticenergy: 1820.62276069 hartree
xcener: -150.532131078046 hartree
chargesum: -0.0000000
charge: 0.849254 -0.440922 -0.437504 -0.395335 -0.265318 -0.262680 0.178839 -0.200155 -0.280052 -0.269935 -0.189897 0.234115 -0.163637 -0.179594 -0.408785 -0.412652 -0.136687 -0.130913 -0.061742 0.289644 -0.175851 0.351912 0.356626 -0.154523 0.384387 0.406938 -0.308316 -0.124693 -0.134422 0.136865 0.216426 0.137855 0.121577 0.112974 0.120568 0.124775 0.122458 0.127246 0.106744 0.122803 0.107998 0.125228 0.120974 0.110646 0.166760
qa: 0.8493 -0.4409 -0.4375 -0.3953 -0.2653 -0.2627 0.1788 -0.2002 -0.2801 -0.2699 -0.1899 0.2341 -0.1636 -0.1796 -0.4088 -0.4127 -0.1367 -0.1309 -0.0617 0.2896 -0.1759 0.3519 0.3566 -0.1545 0.3844 0.4069 -0.3083 -0.1247 -0.1344 0.1369 0.2164 0.1379 0.1216 0.1130 0.1206 0.1248 0.1225 0.1272 0.1067 0.1228 0.1080 0.1252 0.1210 0.1106 0.1668
va: 5.9099 2.0552 2.0678 2.1175 2.1462 2.1606 3.3479 3.0861 2.9072 2.9064 2.9447 3.3678 3.1637 2.8241 2.9730 2.9649 4.0647 3.7894 4.0962 4.0449 3.8635 4.3881 4.2506 3.8845 4.0544 4.0171 3.9435 3.8784 3.8634 1.0154 1.0532 0.9978 0.9947 1.0090 0.9928 0.9925 1.0010 1.0226 0.9971 0.9941 0.9970 0.9953 0.9930 0.9963 1.0369
dispcorr: -0.025537838 hartree
energy: -1826.990614924747
dipole: 9.35881 -7.76978 1.58903 -4.79767 3.28764 -1.51002 -5.33054 4.20203 -1.12851
magnitude: 2.46551 au
magnitude: 6.26682 debye
