program: Orca
programVersion: 4.2.1
elementType: S O O O O O O O N N N N C C C C C C C C C C C C C C C C H H H H H H H H H H H H H H H H H H
charge: 0
multiplicity: 1
keywords: wb97x-d3
keywords: def2-TZVPP
keywords: def2/J RIJCOSX GRIDX6 NOFINALGRIDX
keywords: grid4 nofinalgrid
keywords: scfconv7
keywords: smallprint printgap noloewdin
keywords: NOSOSCF
formula: C16H18N4O7S
InChI: InChI=1S/C16H18N4O7S/c1-25-12-8-13(26-2)18-15(17-12)19-16(22)20-28(23,24)9-10-6-4-5-7-11(10)14(21)27-3/h4-8,19-20H,9H2,1-3H3
46 atoms
S  1.537039 -0.920075 0.127235
O  2.342891 -1.968546 0.722344
O  1.906578 0.468126 0.354312
O  2.638842 2.734708 -1.862986
O  0.854462 1.559027 -2.495307
O  -0.361915 -3.22904 0.357261
O  -2.214245 2.563449 1.856304
O  -5.765346 -0.150244 3.116233
N  -0.023425 -1.002633 0.68785
N  -2.03082 -2.002357 1.258181
N  -2.095711 0.300067 1.564484
N  -3.898447 -1.087362 2.186278
C  1.403514 -1.215516 -1.640397
C  2.692948 -0.803808 -2.28321
C  3.01693 0.536001 -2.541268
C  3.635367 -1.789705 -2.550008
C  4.263987 0.84989 -3.074644
C  4.869951 -1.471067 -3.094795
C  5.183589 -0.147886 -3.359241
C  2.043561 1.636366 -2.294045
C  -0.766533 -2.149426 0.738003
C  -2.695115 -0.871923 1.689058
C  -2.770078 1.369318 1.97496
C  -4.555903 -0.012231 2.600514
C  -4.037773 1.275785 2.520567
C  1.81588 3.882012 -1.642029
C  -0.918037 2.667039 1.268739
C  -6.334979 -1.454194 3.213213
H  0.53868 -0.661875 -1.996879
H  1.213646 -2.280733 -1.767632
H  3.395208 -2.822908 -2.334572
H  -0.495407 -0.126225 0.961398
H  4.522322 1.878248 -3.286258
H  5.584177 -2.255464 -3.305374
H  6.143307 0.112882 -3.78378
H  -2.555638 -2.864191 1.326953
H  -4.587645 2.142229 2.857799
H  1.328692 4.208049 -2.560835
H  1.060001 3.686839 -0.880958
H  2.482833 4.663691 -1.290896
H  -0.687172 3.728671 1.259169
H  -0.164048 2.149758 1.862662
H  -0.909234 2.290643 0.244656
H  -7.316072 -1.311354 3.657641
H  -6.449821 -1.917953 2.233865
H  -5.743028 -2.106431 3.854897
elementType: S O N C H
totalener: -1764.53099676 hartree
nucrepener: 2940.39928722 hartree
electener: -4704.93028398 hartree
oneelecener: -8264.89309208 hartree
twoeener: 3559.96280811 hartree
cpcmener: -0.05235167 hartree
kineticenergy: 1758.11310840 hartree
xcener: -145.279128366299 hartree
chargesum: -0.0000000
charge: 0.866217 -0.508811 -0.523612 -0.281960 -0.464191 -0.492540 -0.298400 -0.299950 -0.208750 -0.140925 -0.427066 -0.426280 -0.193345 -0.056863 0.006554 -0.105411 -0.175787 -0.139456 -0.153806 0.503047 0.389940 0.371641 0.427236 0.423098 -0.326868 -0.116401 -0.124132 -0.114401 0.171352 0.161107 0.143158 0.205809 0.149682 0.166569 0.165564 0.192281 0.148534 0.123528 0.103547 0.132064 0.144736 0.116872 0.104698 0.133153 0.114277 0.114293
qa: 0.8662 -0.5088 -0.5236 -0.2820 -0.4642 -0.4925 -0.2984 -0.3000 -0.2087 -0.1409 -0.4271 -0.4263 -0.1933 -0.0569 0.0066 -0.1054 -0.1758 -0.1395 -0.1538 0.5030 0.3899 0.3716 0.4272 0.4231 -0.3269 -0.1164 -0.1241 -0.1144 0.1714 0.1611 0.1432 0.2058 0.1497 0.1666 0.1656 0.1923 0.1485 0.1235 0.1035 0.1321 0.1447 0.1169 0.1047 0.1332 0.1143 0.1143
va: 5.7182 1.9657 1.9595 2.1176 2.0255 2.0155 2.1345 2.1217 3.0577 3.1904 2.9839 2.9690 3.8145 3.7386 3.6722 3.9255 3.9847 3.9091 3.9222 4.0488 4.3978 4.2502 3.9773 4.0155 3.9355 3.8675 3.8366 3.8450 1.0277 1.0174 1.0032 1.0830 1.0153 0.9871 0.9884 1.0167 1.0155 0.9952 0.9929 0.9953 0.9927 0.9930 0.9999 0.9932 0.9954 0.9954
dispcorr: -0.025004611 hartree
energy: -1764.556001369454
dipole: -2.84465 1.17434 -1.67031 8.63347 -7.13812 1.49535 -3.19965 2.58434 -0.61530
magnitude: 2.32478 au
magnitude: 5.90912 debye
