program: Gaussian 09
title: 000069085
version: EM64L-G09RevD.01
frameworkgroup: C1[X(C9H6N2O2)]
method: RPBEPBE
basis: SDD
operation: Freq
keyword: #pfreq=noraman
keyword: PBEPBE/SDD
title: #p freq=noraman PBEPBE/SDD
converged: NO YES YES YES
title: Mulliken charges:
elementType: O O N N C C C C C C C C C H H H H H H
charge: -0.205391 -0.211693 0.024542 0.011645 0.288819 0.355194 0.233836 -0.396579 -0.282468 -0.367128 -0.216623 -0.488580 -0.351625 0.248872 0.303320 0.293823 0.247066 0.260721 0.252250
chargesum: 0.00000
title: Mulliken charges with hydrogens summed into heavy atoms:
elementType: O O N N C C C C C C C C C
charge: -0.205391 -0.211693 0.024542 0.011645 0.288819 0.355194 0.233836 -0.147707 0.020852 -0.073305 0.030443 -0.227859 -0.099375
polarizability: 1.68649424e+02 8.69973741e+00 1.49464130e+02 -1.07002864e-03 2.94934330e-03 4.47487680e+01
1716.lowfreq: 0.0006 0.0008 0.0010 2.8088 9.2295 12.5572 14.5859 98.6311 177.4291
frequency: 9.7348 98.6297 177.4288 219.2580 229.3621 350.3537 363.2999 375.5968 448.5472 464.6807 509.1731 535.0534 566.6380 628.4274 661.5796 697.0888 747.7407 766.9105 785.2524 820.0864 843.1675 860.9408 925.2924 968.2971 979.1573 993.9705 1006.3145 1031.4117 1086.3039 1158.8935 1180.0984 1193.1471 1205.2063 1238.8304 1271.7595 1347.6802 1361.6682 1375.8352 1403.9337 1424.7045 1442.2271 1490.5238 1558.2840 1563.1903 1621.8725 3112.2500 3136.7831 3153.9211 3165.5690 3185.1843 3222.7143
redmass: 13.6769 4.9177 5.3117 4.0238 9.1139 7.3301 9.6634 3.0995 6.3033 4.3522 3.4979 7.4456 7.7981 3.7218 7.8186 5.2781 8.5828 2.2689 6.2633 1.7449 6.2009 1.3906 1.4401 1.4488 6.0799 1.3907 1.3768 2.8509 1.9768 1.9358 1.7748 3.8892 1.6996 2.1040 1.7752 4.4568 3.5187 2.1395 5.2280 2.4694 2.0839 3.8731 5.9886 6.1861 7.1998 1.0913 1.0892 1.0920 1.0932 1.0960 1.0939
irintensity: 0.0926 4.4225 0.0404 0.2101 3.3204 0.6454 0.9284 1.5348 0.1665 1.8906 18.9379 0.3119 1.8481 2.1255 14.1147 6.0223 9.5689 28.2157 1.6044 4.1440 7.2944 78.2288 3.8802 0.1959 24.0870 0.6886 3.3125 6.7151 7.1211 9.3059 72.4224 250.4595 14.7408 44.8115 3.1765 18.9450 42.1606 47.7692 1.6130 2.3464 5.4788 26.7594 28.2669 42.3455 29.3033 13.8398 3.5288 16.0559 10.4783 5.1887 8.0500
temp: 298.150 k
press: 1.00000 atm
elementType: 8 8 7 7 6 6 6 6 6 6 6 6 6 1 1 1 1 1 1
symmnumber: 1
zpe: 352682.9 jmol-1
zpe.correction: 0.134330 hartree
zpe.thermalcorrener: 0.143900 hartree
zpe.thermalcorrenthalpy: 0.144845 hartree
zpe.thermalcorrgfe: 0.097315 hartree
zpe.sumelectzpe: -605.525739 hartree
zpe.sumelectthermal: -605.516169 hartree
zpe.sumelectthermalent: -605.515224 hartree
zpe.sumelectthermalfe: -605.562754 hartree
dipole: -1.7217 4.0037 -0.0003
dipole: 4.3582
quadrupole: -91.5374 -63.8686 -75.8200
quadrupole: 2.2278 -0.0010 0.0018
quadrupole: -14.4620 13.2067 1.2553 2.2278 -0.0010 0.0018
hfenergy: -605.6600689 hartree
pointgroup: C01 [X(C9H6N2O2)]
dipole: 0.6381612 1.5914626 0.0001263 debye
dipolederiv: -1.064569 0.0203417 0.0001095 0.0486609 -0.4183752 -0.0000629 -0.0001353 0.0000076 -0.2284136 -0.4680972 -0.0199931 -0.0000072 -0.1112986 -0.804456 0.0000262 0.00001 -0.0001323 -0.2276897 1.6610328 0.2702955 -0.0000908 0.4710405 1.2129882 0.000072 0.0000178 0.0000578 0.1914609 -0.2945542 0.0708832 -0.0000025 0.0219831 -0.4610806 0.0000104 0.0000076 0.0000147 -0.2419361 0.1927491 -0.0595282 0.0000124 -0.3534906 0.0795829 -0.0000069 0.0000217 0.0000128 0.0513171 -0.2338607 -0.0843088 0.0000129 0.0822169 -0.2469381 0.0000201 0.0000114 0.0000188 0.0879847 -0.3631415 -0.1507044 -0.000009 -0.4996008 -0.3921067 -0.0000179 0.0000561 0.00003 0.0269144 0.3333393 0.1369356 -0.0000183 -0.1888944 0.1229744 -0.0000148 0.000003 -0.0000185 -0.1038477 -0.3636461 0.197553 -0.0000146 0.1779099 -0.1044966 -0.000005 -0.0000239 0.0000073 -0.0985618 0.1000241 0.0228588 -0.0000194 0.4604003 0.1645587 -0.0000153 0.0000315 0.0000265 -0.0712254 -0.509672 -0.1788253 0.0000135 -0.1320664 0.1282229 -0.0000191 0.000021 -0.0000164 -0.1616272 0.3788563 0.0330119 -0.0000132 0.0568268 0.267374 -0.0000194 -0.0000066 -0.0000235 -0.0636028 0.2395079 -0.1410007 0.0000066 0.0433845 0.4204604 -0.0000295 -0.0000223 -0.0000266 -0.0783567 0.011946 -0.1134423 0.000011 -0.0464307 0.0211636 0.0000099 0.0000134 0.0000167 0.1529979 0.1389276 -0.0900749 0.0000053 -0.0034526 0.0734229 0.0000103 0.0000144 0.0000011 0.1664883 0.0573842 0.0342985 0.0000043 0.0030163 0.1384488 0.0000029 0.0000016 -0.0000026 0.1663775 0.0707126 0.0529814 -0.000003 0.0362678 -0.0724203 0.000012 -0.0000197 0.0000081 0.1620885 0.0330919 -0.0609212 0.0000054 -0.1043797 -0.0466378 0.000013 -0.0000041 0.0000087 0.1239937 0.0799692 0.0596393 -0.0000028 0.0379068 -0.0826855 0.0000138 0.0000025 0.0000099 0.145638 unknown
polarizability: 169.068199|-8.2143617|149.0453547|-0.0009967|-0.0029749|44.748768 unknown
InChI: InChI=1S/C9H6N2O2/c12-11(13)9-3-1-2-7-6-10-5-4-8(7)9/h1-6H
charge 0 multiplicity 1
19 atoms
O  -3.483879 -0.352486 0.000005
O  -2.020098 -2.087414 -0.000181
N  -2.278449 -0.821026 0.000171
N  3.083813 -0.784999 -0.000015
C  0.236114 -0.253674 0.000032
C  1.217205 0.819489 -0.000063
C  -1.151592 0.152672 0.00006
C  0.812648 2.190503 -0.000135
C  0.755168 -1.591813 0.000095
C  -1.524442 1.504216 -0.000014
C  -0.541892 2.530382 -0.000113
C  2.612692 0.474004 -0.000086
C  2.138403 -1.796872 0.000074
H  1.585152 2.968301 -0.000211
H  0.075651 -2.441971 0.000161
H  -2.590434 1.746456 0.000016
H  -0.858103 3.577608 -0.000172
H  3.361236 1.277072 -0.000145
H  2.545006 -2.81335 0.000122
