program: Orca
programVersion: 4.2.1
elementType: S O O O O O O O N N N N C C C C C C C C C C C C C C C C H H H H H H H H H H H H H H H H H H
charge: 0
multiplicity: 1
keywords: wb97x-d3
keywords: def2-TZVPP
keywords: def2/J RIJCOSX GRIDX6 NOFINALGRIDX
keywords: grid4 nofinalgrid
keywords: scfconv7
keywords: smallprint printgap noloewdin
keywords: NOSOSCF
formula: C16H18N4O7S
InChI: InChI=1S/C16H18N4O7S/c1-25-12-8-13(26-2)18-15(17-12)19-16(22)20-28(23,24)9-10-6-4-5-7-11(10)14(21)27-3/h4-8,19-20H,9H2,1-3H3
46 atoms
S  0.504879 -2.681568 -1.170463
O  -0.700848 -3.129572 -1.845375
O  1.383493 -3.654326 -0.554461
O  0.583705 2.139475 -0.595154
O  0.2007 0.979606 -2.45435
O  1.744023 -1.614052 1.430245
O  -3.846758 0.438968 -0.564196
O  -2.822977 3.11544 3.089518
N  -0.033716 -1.608559 -0.016131
N  0.037049 -0.20403 1.827591
N  -1.917541 0.096125 0.610421
N  -1.382173 1.456798 2.461349
C  1.440812 -1.663173 -2.321928
C  2.432372 -0.803758 -1.604198
C  2.149463 0.493352 -1.142844
C  3.663985 -1.372098 -1.302817
C  3.105141 1.168588 -0.383977
C  4.612239 -0.685585 -0.563098
C  4.327913 0.586502 -0.09562
C  0.881803 1.201072 -1.478626
C  0.665962 -1.184502 1.089743
C  -1.139624 0.477396 1.610022
C  -3.049476 0.771851 0.436426
C  -2.517713 2.116943 2.279401
C  -3.419146 1.817121 1.263602
C  -0.502771 3.016006 -0.902384
C  -3.436053 -0.596532 -1.455815
C  -1.911252 3.47017 4.127671
H  0.711218 -1.113243 -2.907961
H  1.937341 -2.380069 -2.979027
H  3.885547 -2.369722 -1.658514
H  -0.956719 -1.171804 -0.167519
H  2.908267 2.168528 -0.02541
H  5.566437 -1.147396 -0.34887
H  5.057314 1.132663 0.486518
H  0.575468 0.116584 2.621665
H  -4.336094 2.369834 1.122452
H  -1.431322 2.474907 -1.077479
H  -0.615331 3.664997 -0.039201
H  -0.275595 3.621638 -1.780176
H  -4.23235 -0.685893 -2.18894
H  -2.511256 -0.335129 -1.97246
H  -3.321511 -1.550858 -0.941936
H  -2.368637 4.309749 4.643148
H  -1.76539 2.652801 4.832743
H  -0.946133 3.778442 3.727203
elementType: S O N C H
totalener: -1764.52897773 hartree
nucrepener: 3147.30251195 hartree
electener: -4911.83148967 hartree
oneelecener: -8678.23498625 hartree
twoeener: 3766.40349657 hartree
cpcmener: -0.05258051 hartree
kineticenergy: 1758.12449441 hartree
xcener: -145.284651029055 hartree
chargesum: -0.0000000
charge: 0.857016 -0.523930 -0.502490 -0.273316 -0.457960 -0.444985 -0.294350 -0.297703 -0.195929 -0.106070 -0.402004 -0.409236 -0.214251 -0.063512 0.046663 -0.101067 -0.152454 -0.143109 -0.151092 0.479047 0.289397 0.333706 0.375807 0.410888 -0.296824 -0.166469 -0.113185 -0.114841 0.174257 0.159741 0.140161 0.206452 0.147995 0.167797 0.164997 0.193438 0.145635 0.125575 0.139123 0.148983 0.140843 0.099034 0.115440 0.133613 0.115119 0.114052
qa: 0.8570 -0.5239 -0.5025 -0.2733 -0.4580 -0.4450 -0.2944 -0.2977 -0.1959 -0.1061 -0.4020 -0.4092 -0.2143 -0.0635 0.0467 -0.1011 -0.1525 -0.1431 -0.1511 0.4790 0.2894 0.3337 0.3758 0.4109 -0.2968 -0.1665 -0.1132 -0.1148 0.1743 0.1597 0.1402 0.2065 0.1480 0.1678 0.1650 0.1934 0.1456 0.1256 0.1391 0.1490 0.1408 0.0990 0.1154 0.1336 0.1151 0.1141
va: 5.7405 1.9611 1.9763 2.1028 2.0298 2.0599 2.1205 2.1259 3.0150 3.1735 2.9303 2.9478 3.8285 3.6923 3.4740 3.9290 3.9666 3.9276 3.9267 4.0228 4.4826 4.2458 3.9858 4.0014 3.9262 3.8653 3.8400 3.8467 1.0319 1.0116 1.0055 1.0835 1.0189 0.9859 0.9882 1.0171 1.0169 0.9761 0.9877 0.9957 0.9969 0.9970 0.9925 0.9934 0.9951 0.9946
dispcorr: -0.031880123 hartree
energy: -1764.560857850576
dipole: -2.08274 1.84313 -0.23962 14.44747 -10.54976 3.89771 1.17778 -0.45271 0.72506
magnitude: 3.97181 au
magnitude: 10.09554 debye
