program: Orca
programVersion: 4.2.1
elementType: S O O O O O O O N N N N C C C C C C C C C C C C C C C C H H H H H H H H H H H H H H H H H H
charge: 0
multiplicity: 1
keywords: wb97x-d3
keywords: def2-TZVPP
keywords: def2/J RIJCOSX GRIDX6 NOFINALGRIDX
keywords: grid4 nofinalgrid
keywords: scfconv7
keywords: smallprint printgap noloewdin
keywords: NOSOSCF
formula: C16H18N4O7S
InChI: InChI=1S/C16H18N4O7S/c1-25-12-8-13(26-2)18-15(17-12)19-16(22)20-28(23,24)9-10-6-4-5-7-11(10)14(21)27-3/h4-8,19-20H,9H2,1-3H3
46 atoms
S  2.232053 -1.546572 -0.651429
O  2.641854 -0.391762 -1.434698
O  2.898106 -2.816488 -0.855996
O  3.728909 1.347722 0.779797
O  2.532559 2.781282 -0.436516
O  0.198178 -3.592834 0.186991
O  -5.096235 0.522501 0.510498
O  -1.435354 2.105034 -1.855338
N  0.602299 -1.684096 -0.991178
N  -1.540851 -2.228635 -0.274823
N  -3.327868 -0.868488 0.099233
N  -1.475851 -0.06306 -1.121702
C  2.285736 -1.133306 1.102359
C  1.291686 -0.059482 1.427823
C  1.397125 1.277209 1.011845
C  0.135409 -0.458082 2.092765
C  0.332046 2.148653 1.226584
C  -0.905721 0.425253 2.33353
C  -0.814273 1.731365 1.882931
C  2.595164 1.869051 0.353456
C  -0.210254 -2.570017 -0.322159
C  -2.131103 -0.988227 -0.442541
C  -3.900163 0.322226 -0.016492
C  -2.055121 1.130549 -1.213698
C  -3.298715 1.392283 -0.666273
C  4.937685 1.811622 0.174631
C  -5.736183 -0.545379 1.206397
C  -0.192782 1.834621 -2.499125
H  3.32599 -0.881591 1.304558
H  2.059812 -2.052627 1.642112
H  0.047262 -1.482444 2.4328
H  0.139338 -0.81974 -1.314621
H  0.406622 3.174243 0.892418
H  -1.784613 0.086991 2.86472
H  -1.624522 2.42747 2.048511
H  -2.11113 -2.898923 0.22435
H  -3.769975 2.36083 -0.744053
H  4.921804 1.66982 -0.90516
H  5.11473 2.861786 0.402137
H  5.733442 1.211483 0.604309
H  -5.923191 -1.397086 0.553839
H  -5.153767 -0.870811 2.067668
H  -6.684913 -0.142452 1.549044
H  0.120413 2.775932 -2.940146
H  0.569252 1.509179 -1.79434
H  -0.30606 1.090801 -3.287177
elementType: S O N C H
totalener: -1764.52922912 hartree
nucrepener: 3176.47828572 hartree
electener: -4941.00751484 hartree
oneelecener: -8735.84486142 hartree
twoeener: 3794.83734658 hartree
cpcmener: -0.05199469 hartree
kineticenergy: 1758.13603342 hartree
xcener: -145.286290855027 hartree
chargesum: 0.0000000
charge: 0.870264 -0.520444 -0.508331 -0.281744 -0.463048 -0.457735 -0.298915 -0.296371 -0.180703 -0.129376 -0.396863 -0.388804 -0.180765 -0.078685 0.001527 -0.098347 -0.149968 -0.122285 -0.149003 0.485198 0.299018 0.290951 0.432516 0.420724 -0.326865 -0.122164 -0.115551 -0.091030 0.168270 0.162308 0.156355 0.205023 0.142386 0.165410 0.161013 0.194909 0.141656 0.115526 0.124221 0.127953 0.115153 0.113147 0.133301 0.142066 0.049146 0.138955
qa: 0.8703 -0.5204 -0.5083 -0.2817 -0.4630 -0.4577 -0.2989 -0.2964 -0.1807 -0.1294 -0.3969 -0.3888 -0.1808 -0.0787 0.0015 -0.0983 -0.1500 -0.1223 -0.1490 0.4852 0.2990 0.2910 0.4325 0.4207 -0.3269 -0.1222 -0.1156 -0.0910 0.1683 0.1623 0.1564 0.2050 0.1424 0.1654 0.1610 0.1949 0.1417 0.1155 0.1242 0.1280 0.1152 0.1131 0.1333 0.1421 0.0491 0.1390
va: 5.7173 1.9495 1.9793 2.1365 2.0287 2.0415 2.1232 2.1148 3.0616 3.1666 2.9322 2.9304 3.8205 3.6745 3.6052 3.7871 3.8363 3.8271 3.8774 4.0439 4.4766 4.3149 3.9772 3.9375 3.9308 3.8583 3.8492 3.8396 1.0241 1.0199 0.9997 1.0865 1.0229 0.9919 0.9909 1.0147 1.0194 0.9974 0.9931 0.9937 0.9949 0.9945 0.9936 0.9957 0.9969 0.9942
dispcorr: -0.034028395 hartree
energy: -1764.563257514827
dipole: -4.56241 1.92240 -2.64001 8.56687 -7.13627 1.43060 5.42469 -3.23881 2.18587
magnitude: 3.71407 au
magnitude: 9.44042 debye
