program: Orca
programVersion: 4.2.1
elementType: S O O O O O O O N N N N C C C C C C C C C C C C C C C C H H H H H H H H H H H H H H H H H H
charge: 0
multiplicity: 1
keywords: wb97x-d3
keywords: def2-TZVPP
keywords: def2/J RIJCOSX GRIDX6 NOFINALGRIDX
keywords: grid4 nofinalgrid
keywords: scfconv7
keywords: smallprint printgap noloewdin
keywords: NOSOSCF
formula: C16H18N4O7S
InChI: InChI=1S/C16H18N4O7S/c1-25-12-8-13(26-2)18-15(17-12)19-16(22)20-28(23,24)9-10-6-4-5-7-11(10)14(21)27-3/h4-8,19-20H,9H2,1-3H3
46 atoms
S  2.245948 -1.662831 0.644997
O  2.861699 -2.933675 0.966234
O  2.762986 -0.445226 1.247095
O  2.631934 2.534495 -0.099702
O  3.80988 1.046416 -1.270962
O  0.056489 -3.681894 0.217307
O  -5.040602 0.667013 -0.260167
O  -1.154605 2.3001 1.676005
N  0.639284 -1.662311 1.099281
N  -1.574337 -2.170715 0.612811
N  -3.315574 -0.76401 0.195347
N  -1.344913 0.071065 1.190205
C  2.198546 -1.472203 -1.147928
C  1.219892 -0.410125 -1.545199
C  1.426282 0.959865 -1.326266
C  -0.002171 -0.827243 -2.062153
C  0.398726 1.861984 -1.592437
C  -1.010973 0.079286 -2.352447
C  -0.81436 1.42723 -2.10409
C  2.749814 1.488413 -0.894878
C  -0.261787 -2.578868 0.610692
C  -2.090296 -0.887842 0.668458
C  -3.820799 0.462213 0.208155
C  -1.861193 1.296791 1.18555
C  -3.125999 1.56364 0.691742
C  3.833116 3.161632 0.352543
C  -5.773813 -0.435142 -0.790867
C  0.103083 2.0295 2.290154
H  1.915964 -2.442751 -1.554659
H  3.229793 -1.276084 -1.438798
H  -0.167051 -1.881161 -2.248927
H  0.243766 -0.741787 1.346465
H  0.547761 2.919623 -1.425952
H  -1.945131 -0.271826 -2.768558
H  -1.596596 2.143147 -2.315791
H  -2.214112 -2.864259 0.246781
H  -3.545987 2.558446 0.69187
H  4.425448 3.539249 -0.479936
H  3.516577 3.993252 0.974466
H  4.435477 2.475986 0.947482
H  -5.266271 -0.882313 -1.645047
H  -5.954604 -1.200496 -0.036814
H  -6.724675 -0.022771 -1.116502
H  0.48319 2.992585 2.618858
H  -0.008708 1.376568 3.155686
H  0.813738 1.592378 1.59155
elementType: S O N C H
totalener: -1764.52964970 hartree
nucrepener: 3173.32322087 hartree
electener: -4937.85287057 hartree
oneelecener: -8729.44339387 hartree
twoeener: 3791.59052330 hartree
cpcmener: -0.05378092 hartree
kineticenergy: 1758.12825649 hartree
xcener: -145.284073394265 hartree
chargesum: -0.0000000
charge: 0.866937 -0.509027 -0.516344 -0.266221 -0.463804 -0.458342 -0.298780 -0.296565 -0.182899 -0.128243 -0.397626 -0.389449 -0.196305 -0.058721 -0.013936 -0.096808 -0.166312 -0.122411 -0.147597 0.491649 0.297535 0.290913 0.432121 0.424648 -0.328953 -0.119997 -0.115459 -0.094984 0.163402 0.167270 0.158849 0.206002 0.146747 0.163737 0.160080 0.194801 0.141998 0.123095 0.126058 0.116334 0.113144 0.114825 0.133572 0.140819 0.138752 0.055495
qa: 0.8669 -0.5090 -0.5163 -0.2662 -0.4638 -0.4583 -0.2988 -0.2966 -0.1829 -0.1282 -0.3976 -0.3894 -0.1963 -0.0587 -0.0139 -0.0968 -0.1663 -0.1224 -0.1476 0.4916 0.2975 0.2909 0.4321 0.4246 -0.3290 -0.1200 -0.1155 -0.0950 0.1634 0.1673 0.1588 0.2060 0.1467 0.1637 0.1601 0.1948 0.1420 0.1231 0.1261 0.1163 0.1131 0.1148 0.1336 0.1408 0.1388 0.0555
va: 5.7245 1.9793 1.9532 2.1209 2.0340 2.0415 2.1229 2.1143 3.0570 3.1656 2.9305 2.9297 3.7964 3.6415 3.6222 3.7846 3.8794 3.8234 3.8744 4.0612 4.4770 4.3160 3.9789 3.9327 3.9346 3.8545 3.8493 3.8425 1.0200 1.0320 0.9991 1.0852 1.0191 0.9927 0.9910 1.0147 1.0191 0.9944 0.9954 0.9955 0.9945 0.9951 0.9933 0.9953 0.9937 0.9956
dispcorr: -0.033706651 hartree
energy: -1764.563356352971
dipole: -7.27602 3.49628 -3.77974 12.11249 -9.21741 2.89508 -3.47385 2.38808 -1.08577
magnitude: 4.88332 au
magnitude: 12.41240 debye
