program: Orca
programVersion: 4.2.1
elementType: S O O O O O O O N N N N C C C C C C C C C C C C C C C C H H H H H H H H H H H H H H H H H H
charge: 0
multiplicity: 1
keywords: wb97x-d3
keywords: def2-TZVPP
keywords: def2/J RIJCOSX GRIDX6 NOFINALGRIDX
keywords: grid4 nofinalgrid
keywords: scfconv7
keywords: smallprint printgap noloewdin
keywords: NOSOSCF
formula: C16H18N4O7S
InChI: InChI=1S/C16H18N4O7S/c1-25-12-8-13(26-2)18-15(17-12)19-16(22)20-28(23,24)9-10-6-4-5-7-11(10)14(21)27-3/h4-8,19-20H,9H2,1-3H3
46 atoms
S  0.821794 0.651979 -0.567091
O  1.792248 0.795578 0.50044
O  0.310439 1.8429 -1.222665
O  4.882423 0.178506 0.367856
O  3.761715 -1.654797 -0.235545
O  0.448647 -1.927278 0.919748
O  -5.915627 -1.184582 3.150406
O  -4.272509 2.166326 0.390551
N  -0.554164 -0.109412 -0.008879
N  -1.717223 -1.527819 1.414049
N  -3.816347 -1.364887 2.273883
N  -2.995053 0.332664 0.858876
C  1.47941 -0.468188 -1.803952
C  2.699864 0.160851 -2.407508
C  3.941819 0.174271 -1.760482
C  2.567467 0.824889 -3.6218
C  5.019885 0.828927 -2.349024
C  3.650168 1.456211 -4.214133
C  4.880474 1.455854 -3.577078
C  4.159197 -0.541607 -0.471311
C  -0.52865 -1.224802 0.78744
C  -2.891403 -0.812778 1.511216
C  -4.949116 -0.68851 2.400772
C  -4.131186 1.00713 1.005285
C  -5.175121 0.536844 1.783386
C  5.183605 -0.402721 1.636145
C  -5.714128 -2.440181 3.793062
C  -3.180166 2.684702 -0.364801
H  0.692253 -0.606737 -2.545265
H  1.673241 -1.420998 -1.316482
H  1.604556 0.838152 -4.116173
H  -1.427428 0.438259 -0.018879
H  5.982956 0.837487 -1.856596
H  3.529132 1.952179 -5.167917
H  5.731943 1.945616 -4.030162
H  -1.69662 -2.386031 1.949417
H  -6.098154 1.084784 1.904511
H  5.787008 -1.304348 1.530261
H  5.751891 0.347353 2.179214
H  4.275673 -0.637081 2.19172
H  -6.6317 -2.639091 4.340683
H  -5.546768 -3.240329 3.071871
H  -4.879077 -2.407179 4.493064
H  -2.299712 2.844035 0.258503
H  -2.928286 2.039743 -1.207325
H  -3.517132 3.644548 -0.74724
elementType: S O N C H
totalener: -1764.53427229 hartree
nucrepener: 2903.06795346 hartree
electener: -4667.60222575 hartree
oneelecener: -8190.90435677 hartree
twoeener: 3523.30213102 hartree
cpcmener: -0.04482909 hartree
kineticenergy: 1758.13552927 hartree
xcener: -145.277383489138 hartree
chargesum: 0.0000000
charge: 0.873327 -0.484675 -0.522300 -0.275917 -0.430992 -0.455193 -0.291429 -0.289986 -0.231884 -0.144623 -0.426737 -0.432046 -0.192477 -0.060964 0.010515 -0.098473 -0.177852 -0.143480 -0.149285 0.477239 0.373479 0.372973 0.414717 0.419957 -0.322650 -0.124978 -0.115743 -0.125569 0.147919 0.177487 0.137943 0.207204 0.146386 0.162173 0.160455 0.188848 0.144720 0.118430 0.128635 0.114744 0.131162 0.113041 0.113528 0.111972 0.113592 0.136809
qa: 0.8733 -0.4847 -0.5223 -0.2759 -0.4310 -0.4552 -0.2914 -0.2900 -0.2319 -0.1446 -0.4267 -0.4320 -0.1925 -0.0610 0.0105 -0.0985 -0.1779 -0.1435 -0.1493 0.4772 0.3735 0.3730 0.4147 0.4200 -0.3226 -0.1250 -0.1157 -0.1256 0.1479 0.1775 0.1379 0.2072 0.1464 0.1622 0.1605 0.1888 0.1447 0.1184 0.1286 0.1147 0.1312 0.1130 0.1135 0.1120 0.1136 0.1368
va: 5.7205 1.9938 1.9673 2.1093 2.0681 2.0600 2.1307 2.1398 3.0670 3.1785 2.9671 2.9763 3.8285 3.7328 3.6883 3.9235 3.9942 3.9155 3.9249 4.0962 4.4121 4.2456 4.0246 3.9887 3.9278 3.8649 3.8498 3.8434 1.0196 1.0269 1.0036 1.0738 1.0154 0.9886 0.9899 1.0192 1.0164 0.9935 0.9943 0.9963 0.9936 0.9958 0.9955 0.9977 0.9913 0.9965
dispcorr: -0.024073961 hartree
energy: -1764.558346250368
dipole: -0.03330 -1.66082 -1.69413 0.43322 -0.47436 -0.04113 0.28029 -0.75723 -0.47694
magnitude: 1.76046 au
magnitude: 4.47474 debye
