program: Orca
programVersion: 4.2.1
elementType: S O O O O O O O N N N N C C C C C C C C C C C C C C C C H H H H H H H H H H H H H H H H H H
charge: 0
multiplicity: 1
keywords: wb97x-d3
keywords: def2-TZVPP
keywords: def2/J RIJCOSX GRIDX6 NOFINALGRIDX
keywords: grid4 nofinalgrid
keywords: scfconv7
keywords: smallprint printgap noloewdin
keywords: NOSOSCF
formula: C16H18N4O7S
InChI: InChI=1S/C16H18N4O7S/c1-25-12-8-13(26-2)18-15(17-12)19-16(22)20-28(23,24)9-10-6-4-5-7-11(10)14(21)27-3/h4-8,19-20H,9H2,1-3H3
46 atoms
S  1.100075 -0.872665 -0.185902
O  1.357948 -2.270516 0.093997
O  1.675726 0.145777 0.676875
O  2.72483 2.069808 -1.477225
O  4.44747 1.901236 -0.075188
O  -1.21298 -2.252422 -1.490702
O  -6.33485 0.100166 2.279252
O  -2.186037 2.070191 2.957138
N  -0.537075 -0.564724 -0.124356
N  -2.764019 -1.211654 -0.225991
N  -4.549698 -0.550288 1.015978
N  -2.446074 0.455372 1.363632
C  1.554483 -0.536872 -1.887856
C  3.029584 -0.773483 -2.032453
C  4.017689 0.108273 -1.569187
C  3.422786 -1.997158 -2.566794
C  5.359033 -0.257805 -1.660099
C  4.760019 -2.342099 -2.675031
C  5.73329 -1.46862 -2.217479
C  3.750977 1.434272 -0.941707
C  -1.475316 -1.405806 -0.664258
C  -3.264093 -0.393035 0.764559
C  -5.056338 0.214962 1.972397
C  -2.965787 1.214687 2.323627
C  -4.300584 1.140535 2.683929
C  2.35555 3.323618 -0.90401
C  -7.125836 -0.860362 1.584567
C  -0.804381 2.133311 2.612445
H  1.227652 0.47294 -2.120443
H  0.986773 -1.233288 -2.503893
H  2.665125 -2.691872 -2.906436
H  -0.865721 0.115351 0.577236
H  6.122083 0.417445 -1.296788
H  5.036757 -3.295893 -3.104303
H  6.781079 -1.727731 -2.289204
H  -3.445473 -1.823692 -0.655708
H  -4.723286 1.754982 3.465706
H  3.144507 4.065566 -1.026852
H  1.470817 3.648735 -1.444617
H  2.114429 3.223508 0.154534
H  -7.178274 -0.645215 0.517057
H  -6.749322 -1.873474 1.728353
H  -8.121743 -0.785064 2.013546
H  -0.375555 2.896186 3.256955
H  -0.296918 1.186892 2.803111
H  -0.660491 2.430822 1.572651
elementType: S O N C H
totalener: -1764.53393903 hartree
nucrepener: 2920.67288264 hartree
electener: -4685.20682167 hartree
oneelecener: -8224.89739196 hartree
twoeener: 3539.69057029 hartree
cpcmener: -0.04543140 hartree
kineticenergy: 1758.13331351 hartree
xcener: -145.278177573407 hartree
chargesum: 0.0000000
charge: 0.875990 -0.490924 -0.513644 -0.277677 -0.442868 -0.468971 -0.291618 -0.290175 -0.234950 -0.144494 -0.425710 -0.432133 -0.186652 -0.061451 0.004053 -0.109672 -0.156552 -0.139138 -0.147250 0.465804 0.386460 0.370812 0.417014 0.422113 -0.324069 -0.121016 -0.115267 -0.120977 0.161006 0.164527 0.137333 0.205739 0.141384 0.163242 0.161913 0.189752 0.145738 0.126301 0.126176 0.112387 0.112899 0.113493 0.131662 0.139405 0.112572 0.107430
qa: 0.8760 -0.4909 -0.5136 -0.2777 -0.4429 -0.4690 -0.2916 -0.2902 -0.2349 -0.1445 -0.4257 -0.4321 -0.1867 -0.0615 0.0041 -0.1097 -0.1566 -0.1391 -0.1473 0.4658 0.3865 0.3708 0.4170 0.4221 -0.3241 -0.1210 -0.1153 -0.1210 0.1610 0.1645 0.1373 0.2057 0.1414 0.1632 0.1619 0.1898 0.1457 0.1263 0.1262 0.1124 0.1129 0.1135 0.1317 0.1394 0.1126 0.1074
va: 5.7223 1.9942 1.9716 2.1099 2.0611 2.0445 2.1315 2.1423 3.0666 3.1811 2.9663 2.9774 3.8582 3.7676 3.6922 3.9315 3.9723 3.9145 3.9250 4.1117 4.4025 4.2498 4.0229 3.9867 3.9294 3.8555 3.8494 3.8461 1.0273 1.0131 1.0045 1.0764 1.0180 0.9882 0.9895 1.0186 1.0161 0.9946 0.9931 0.9969 0.9957 0.9959 0.9933 0.9957 0.9982 0.9921
dispcorr: -0.024584894 hartree
energy: -1764.558523923401
dipole: -2.92474 0.34265 -2.58209 6.84777 -5.50641 1.34135 -1.38708 0.34695 -1.04013
magnitude: 3.09003 au
magnitude: 7.85423 debye
