program: Orca
programVersion: 4.2.1
elementType: S O O O O O O O N N N N C C C C C C C C C C C C C C C C H H H H H H H H H H H H H H H H H H
charge: 0
multiplicity: 1
keywords: wb97x-d3
keywords: def2-TZVPP
keywords: def2/J RIJCOSX GRIDX6 NOFINALGRIDX
keywords: grid4 nofinalgrid
keywords: scfconv7
keywords: smallprint printgap noloewdin
keywords: NOSOSCF
formula: C16H18N4O7S
InChI: InChI=1S/C16H18N4O7S/c1-25-12-8-13(26-2)18-15(17-12)19-16(22)20-28(23,24)9-10-6-4-5-7-11(10)14(21)27-3/h4-8,19-20H,9H2,1-3H3
46 atoms
S  1.606383 -1.219057 0.184692
O  2.229924 -2.40065 0.744606
O  2.12912 0.089342 0.535934
O  2.338263 2.786271 -1.859073
O  0.684611 1.301086 -1.83758
O  -0.578555 -3.22979 0.001848
O  -1.834517 2.471371 2.291126
O  -5.808119 0.118096 2.758572
N  0.007606 -1.135722 0.653331
N  -2.150549 -1.927284 0.965763
N  -1.96278 0.289123 1.637314
N  -3.978901 -0.911736 1.861618
C  1.537677 -1.405782 -1.613022
C  2.750041 -0.787031 -2.238254
C  2.904435 0.596767 -2.422383
C  3.776016 -1.638658 -2.630923
C  4.068266 1.076423 -3.021345
C  4.928448 -1.150512 -3.227027
C  5.070893 0.211679 -3.428852
C  1.85071 1.56552 -2.006025
C  -0.874695 -2.167956 0.50781
C  -2.710674 -0.793696 1.51336
C  -2.541944 1.364439 2.160182
C  -4.542222 0.166506 2.387607
C  -3.863709 1.366622 2.570701
C  1.425089 3.827288 -1.520299
C  -0.487192 2.483079 1.827154
C  -6.536841 -1.091277 2.57495
H  0.61033 -0.957311 -1.956315
H  1.50073 -2.477501 -1.801078
H  3.666088 -2.704307 -2.474862
H  -0.348407 -0.24395 1.021469
H  4.198634 2.136567 -3.184413
H  5.709242 -1.834275 -3.532508
H  5.961179 0.606593 -3.899582
H  -2.784153 -2.70912 0.8636
H  -4.336599 2.239754 2.995887
H  0.600631 3.892081 -2.230188
H  1.025805 3.690782 -0.515259
H  1.999308 4.748764 -1.551187
H  -0.427799 2.249931 0.763091
H  -0.130034 3.495997 1.993623
H  0.141116 1.793258 2.392195
H  -6.593494 -1.373958 1.523504
H  -6.106023 -1.914699 3.145077
H  -7.538929 -0.888053 2.944061
elementType: S O N C H
totalener: -1764.53251987 hartree
nucrepener: 2953.80794760 hartree
electener: -4718.34046747 hartree
oneelecener: -8291.83132800 hartree
twoeener: 3573.49086053 hartree
cpcmener: -0.04134080 hartree
kineticenergy: 1758.14213704 hartree
xcener: -145.281715440162 hartree
chargesum: -0.0000000
charge: 0.854657 -0.495592 -0.514070 -0.276807 -0.453862 -0.469593 -0.291170 -0.291549 -0.209522 -0.145153 -0.432757 -0.426735 -0.177052 -0.057310 -0.017295 -0.101763 -0.159533 -0.133652 -0.150724 0.501349 0.377868 0.371515 0.422671 0.414246 -0.323856 -0.117946 -0.114284 -0.116347 0.166786 0.154165 0.138059 0.207517 0.149281 0.162720 0.161485 0.188968 0.144945 0.117515 0.107742 0.128950 0.089348 0.141959 0.117159 0.113128 0.113147 0.131389
qa: 0.8547 -0.4956 -0.5141 -0.2768 -0.4539 -0.4696 -0.2912 -0.2915 -0.2095 -0.1452 -0.4328 -0.4267 -0.1771 -0.0573 -0.0173 -0.1018 -0.1595 -0.1337 -0.1507 0.5013 0.3779 0.3715 0.4227 0.4142 -0.3239 -0.1179 -0.1143 -0.1163 0.1668 0.1542 0.1381 0.2075 0.1493 0.1627 0.1615 0.1890 0.1449 0.1175 0.1077 0.1289 0.0893 0.1420 0.1172 0.1131 0.1131 0.1314
va: 5.7308 1.9851 1.9652 2.1263 2.0481 2.0436 2.1421 2.1301 3.0545 3.1836 2.9732 2.9675 3.7918 3.8065 3.6832 3.9229 3.9726 3.9164 3.9237 4.0549 4.4109 4.2501 3.9869 4.0267 3.9313 3.8669 3.8403 3.8505 1.0196 1.0202 1.0038 1.0700 1.0190 0.9887 0.9904 1.0194 1.0165 0.9970 0.9959 0.9961 1.0071 0.9946 0.9947 0.9957 0.9954 0.9936
dispcorr: -0.025073057 hartree
energy: -1764.557592926156
dipole: -2.90703 1.53246 -1.37457 9.97358 -8.02662 1.94695 -3.77707 2.77305 -1.00402
magnitude: 2.58614 au
magnitude: 6.57345 debye
