program: Orca
programVersion: 4.2.1
elementType: S O O O O O O O N N N N C C C C C C C C C C C C C C C C H H H H H H H H H H H H H H H H H H
charge: 0
multiplicity: 1
keywords: wb97x-d3
keywords: def2-TZVPP
keywords: def2/J RIJCOSX GRIDX6 NOFINALGRIDX
keywords: grid4 nofinalgrid
keywords: scfconv7
keywords: smallprint printgap noloewdin
keywords: NOSOSCF
formula: C16H18N4O7S
InChI: InChI=1S/C16H18N4O7S/c1-25-12-8-13(26-2)18-15(17-12)19-16(22)20-28(23,24)9-10-6-4-5-7-11(10)14(21)27-3/h4-8,19-20H,9H2,1-3H3
46 atoms
S  1.325396 -2.831669 0.041589
O  1.794036 -3.769807 -0.953833
O  0.763511 -3.314037 1.289291
O  0.990944 1.87276 -1.049148
O  2.944211 0.817385 -1.238269
O  0.914281 -1.575723 -2.703085
O  -2.506229 0.206081 2.228939
O  -3.507411 3.239186 -1.137994
N  0.108113 -1.880966 -0.588172
N  -0.872897 -0.36739 -2.04124
N  -1.720567 -0.127299 0.109787
N  -2.218714 1.414289 -1.603127
C  2.655195 -1.667671 0.4027
C  2.16816 -0.565999 1.29335
C  1.732069 0.67857 0.813942
C  2.044967 -0.836223 2.653165
C  1.145967 1.590904 1.69004
C  1.495085 0.090609 3.524218
C  1.026645 1.30101 3.038614
C  1.96599 1.106448 -0.592998
C  0.117389 -1.305774 -1.83408
C  -1.641703 0.326273 -1.129015
C  -2.411301 0.607714 0.975924
C  -2.91212 2.132595 -0.732391
C  -3.039794 1.785172 0.608119
C  1.133472 2.410193 -2.364573
C  -1.910313 -1.031706 2.605987
C  -3.374052 3.632819 -2.499915
H  3.058076 -1.341474 -0.552851
H  3.419783 -2.274857 0.893137
H  2.386737 -1.788133 3.037784
H  -0.591704 -1.518467 0.076223
H  0.799115 2.547218 1.323637
H  1.419976 -0.141708 4.578153
H  0.580155 2.024579 3.707112
H  -0.879829 0.019338 -2.975944
H  -3.599756 2.385349 1.310393
H  0.179661 2.871418 -2.603315
H  1.917384 3.167378 -2.39212
H  1.357029 1.637592 -3.100199
H  -0.829959 -1.024426 2.464199
H  -2.120554 -1.148882 3.665944
H  -2.347181 -1.870606 2.062909
H  -3.779241 2.884081 -3.180471
H  -3.946085 4.551874 -2.597098
H  -2.334255 3.83025 -2.762924
elementType: S O N C H
totalener: -1764.52881512 hartree
nucrepener: 3192.42342646 hartree
electener: -4956.95224158 hartree
oneelecener: -8767.55076815 hartree
twoeener: 3810.59852657 hartree
cpcmener: -0.04482525 hartree
kineticenergy: 1758.14569927 hartree
xcener: -145.284404461992 hartree
chargesum: 0.0000000
charge: 0.852043 -0.488313 -0.508872 -0.265192 -0.424473 -0.426077 -0.288771 -0.290085 -0.190606 -0.150703 -0.396858 -0.407786 -0.207381 -0.082186 0.041150 -0.070065 -0.176018 -0.157233 -0.141878 0.468391 0.290947 0.335041 0.402584 0.415970 -0.316565 -0.133268 -0.094269 -0.118840 0.168114 0.159091 0.135853 0.210244 0.139892 0.159719 0.159996 0.193412 0.143814 0.123011 0.136853 0.113064 0.047326 0.141377 0.138716 0.113672 0.133641 0.111518
qa: 0.8520 -0.4883 -0.5089 -0.2652 -0.4245 -0.4261 -0.2888 -0.2901 -0.1906 -0.1507 -0.3969 -0.4078 -0.2074 -0.0822 0.0411 -0.0701 -0.1760 -0.1572 -0.1419 0.4684 0.2909 0.3350 0.4026 0.4160 -0.3166 -0.1333 -0.0943 -0.1188 0.1681 0.1591 0.1359 0.2102 0.1399 0.1597 0.1600 0.1934 0.1438 0.1230 0.1369 0.1131 0.0473 0.1414 0.1387 0.1137 0.1336 0.1115
va: 5.7628 2.0057 1.9701 2.1062 2.0756 2.0804 2.1277 2.1318 3.0548 3.1756 2.9545 2.9428 3.8288 3.6894 3.5411 3.8429 3.9310 3.9006 3.8620 4.0187 4.4811 4.2640 3.9716 4.0219 3.9417 3.8484 3.8374 3.8628 1.0363 1.0133 1.0120 1.0775 1.0219 0.9910 0.9905 1.0143 1.0170 0.9934 0.9977 1.0008 0.9991 0.9966 0.9952 0.9949 0.9938 0.9863
dispcorr: -0.034040593 hartree
energy: -1764.562855713785
dipole: -4.85596 2.91397 -1.94199 14.20456 -10.51084 3.69371 3.06475 -1.55829 1.50646
magnitude: 4.43670 au
magnitude: 11.27718 debye
