program: Orca
programVersion: 4.2.1
elementType: S O O O O O O O N N N N C C C C C C C C C C C C C C C C H H H H H H H H H H H H H H H H H H
charge: 0
multiplicity: 1
keywords: wb97x-d3
keywords: def2-TZVPP
keywords: def2/J RIJCOSX GRIDX6 NOFINALGRIDX
keywords: grid4 nofinalgrid
keywords: scfconv7
keywords: smallprint printgap noloewdin
keywords: NOSOSCF
formula: C16H18N4O7S
InChI: InChI=1S/C16H18N4O7S/c1-25-12-8-13(26-2)18-15(17-12)19-16(22)20-28(23,24)9-10-6-4-5-7-11(10)14(21)27-3/h4-8,19-20H,9H2,1-3H3
46 atoms
S  0.586484 -0.255275 -1.377067
O  0.958683 1.09934 -1.003589
O  0.135061 -0.522176 -2.727197
O  3.86828 2.182177 -0.169144
O  3.404683 0.321493 0.965677
O  -1.052869 -2.742704 -1.035965
O  -6.017824 -0.378638 2.938321
O  -2.388569 2.432982 2.250852
N  -0.604178 -0.646677 -0.279048
N  -2.489553 -1.797141 0.427146
N  -4.24712 -1.096983 1.690926
N  -2.40917 0.337489 1.344706
C  1.944124 -1.364811 -0.992096
C  3.144531 -0.905417 -1.764607
C  3.932482 0.181437 -1.361301
C  3.422812 -1.525384 -2.977142
C  4.986134 0.604373 -2.166603
C  4.484489 -1.110314 -3.766053
C  5.26951 -0.044241 -3.35826
C  3.69131 0.877713 -0.066138
C  -1.355792 -1.788475 -0.353095
C  -3.064833 -0.79971 1.185869
C  -4.828745 -0.149854 2.41327
C  -3.003452 1.279296 2.070363
C  -4.248355 1.092266 2.646201
C  3.685562 2.959724 1.013769
C  -6.644855 -1.636177 2.703931
C  -1.113608 2.638344 1.64737
H  1.630155 -2.363798 -1.292559
H  2.08196 -1.350907 0.086282
H  2.803325 -2.350082 -3.305735
H  -0.945462 0.103356 0.339964
H  5.603651 1.437819 -1.860206
H  4.691063 -1.615648 -4.700028
H  6.098997 0.289607 -3.967109
H  -3.027395 -2.65212 0.370564
H  -4.735556 1.857879 3.232184
H  2.666869 2.871186 1.392064
H  4.387805 2.672771 1.796398
H  3.871452 3.990184 0.724613
H  -7.605866 -1.58261 3.208956
H  -6.808364 -1.814981 1.641109
H  -6.0660 -2.460122 3.121607
H  -0.808349 3.639502 1.940284
H  -0.374172 1.923916 2.011932
H  -1.169944 2.592925 0.559267
elementType: S O N C H
totalener: -1764.53471292 hartree
nucrepener: 2919.69015078 hartree
electener: -4684.22486370 hartree
oneelecener: -8223.51864239 hartree
twoeener: 3539.29377869 hartree
cpcmener: -0.04201070 hartree
kineticenergy: 1758.14078259 hartree
xcener: -145.280086945682 hartree
chargesum: -0.0000000
charge: 0.869875 -0.514565 -0.490946 -0.275209 -0.444514 -0.468434 -0.291232 -0.289795 -0.227353 -0.145524 -0.424840 -0.431159 -0.189250 -0.058208 0.010676 -0.101455 -0.173974 -0.141082 -0.150105 0.479736 0.383812 0.370894 0.414358 0.420005 -0.322230 -0.121801 -0.115976 -0.122848 0.157555 0.166433 0.139743 0.204148 0.146234 0.162112 0.161221 0.189513 0.145711 0.110532 0.119237 0.129473 0.131755 0.112805 0.113506 0.139377 0.110491 0.111297
qa: 0.8699 -0.5146 -0.4909 -0.2752 -0.4445 -0.4684 -0.2912 -0.2898 -0.2274 -0.1455 -0.4248 -0.4312 -0.1893 -0.0582 0.0107 -0.1015 -0.1740 -0.1411 -0.1501 0.4797 0.3838 0.3709 0.4144 0.4200 -0.3222 -0.1218 -0.1160 -0.1228 0.1576 0.1664 0.1397 0.2041 0.1462 0.1621 0.1612 0.1895 0.1457 0.1105 0.1192 0.1295 0.1318 0.1128 0.1135 0.1394 0.1105 0.1113
va: 5.7228 1.9705 1.9920 2.1166 2.0498 2.0460 2.1310 2.1419 3.0597 3.1818 2.9667 2.9777 3.8238 3.7453 3.6813 3.9309 3.9903 3.9151 3.9268 4.0856 4.4036 4.2495 4.0268 3.9895 3.9301 3.8706 3.8494 3.8427 1.0193 1.0314 1.0042 1.0782 1.0161 0.9885 0.9897 1.0188 1.0160 0.9919 0.9946 0.9946 0.9936 0.9958 0.9955 0.9950 0.9938 0.9986
dispcorr: -0.024277409 hartree
energy: -1764.558990324650
dipole: 2.44640 -2.75868 -0.31227 5.13476 -4.63344 0.50132 5.55385 -3.90336 1.65050
magnitude: 1.75299 au
magnitude: 4.45575 debye
