program: Orca
programVersion: 4.2.1
elementType: S O O O O O O O N N N N C C C C C C C C C C C C C C C C H H H H H H H H H H H H H H H H H H
charge: 0
multiplicity: 1
keywords: wb97x-d3
keywords: def2-TZVPP
keywords: def2/J RIJCOSX GRIDX6 NOFINALGRIDX
keywords: grid4 nofinalgrid
keywords: scfconv7
keywords: smallprint printgap noloewdin
keywords: NOSOSCF
formula: C16H18N4O7S
InChI: InChI=1S/C16H18N4O7S/c1-25-12-8-13(26-2)18-15(17-12)19-16(22)20-28(23,24)9-10-6-4-5-7-11(10)14(21)27-3/h4-8,19-20H,9H2,1-3H3
46 atoms
S  1.422027 -1.718041 -0.494285
O  0.906266 -1.354356 -1.803179
O  1.632941 -3.113237 -0.164158
O  2.012567 0.856427 -3.839828
O  3.61666 -0.465761 -3.033973
O  1.235685 -1.73067 2.50607
O  -3.430956 0.645286 -0.954956
O  -5.198236 0.266768 3.321212
N  0.311654 -1.03857 0.547684
N  -0.863143 -0.901349 2.543345
N  -2.135446 -0.119265 0.762254
N  -3.023389 -0.308277 2.937624
C  2.943773 -0.829407 -0.168121
C  2.787663 0.64354 -0.375537
C  2.683496 1.234964 -1.641461
C  2.691579 1.450989 0.752134
C  2.497395 2.610627 -1.745457
C  2.528754 2.82313 0.642131
C  2.432725 3.404729 -0.611336
C  2.82424 0.432801 -2.88882
C  0.296818 -1.264346 1.897253
C  -2.055901 -0.420781 2.04713
C  -3.3046 0.333979 0.321195
C  -4.184727 0.142348 2.484915
C  -4.397967 0.491299 1.155683
C  2.066995 0.180185 -5.095194
C  -2.312566 0.474946 -1.822313
C  -5.016431 -0.099656 4.686268
H  3.682963 -1.29019 -0.823306
H  3.220272 -1.063926 0.859936
H  2.756892 0.998625 1.733911
H  -0.532441 -0.617824 0.133303
H  2.422437 3.077116 -2.718372
H  2.474191 3.432234 1.534558
H  2.30711 4.474581 -0.710762
H  -0.853834 -1.071881 3.540487
H  -5.350269 0.855529 0.798854
H  1.320105 0.657922 -5.723159
H  3.046337 0.279037 -5.563631
H  1.821777 -0.876448 -4.98763
H  -2.652495 0.791797 -2.804742
H  -1.470468 1.100636 -1.523664
H  -1.999724 -0.568237 -1.878717
H  -5.977722 0.069236 5.164461
H  -4.744244 -1.150153 4.79023
H  -4.260696 0.51697 5.173122
elementType: S O N C H
totalener: -1764.53563148 hartree
nucrepener: 2988.03340205 hartree
electener: -4752.56903353 hartree
oneelecener: -8359.62858305 hartree
twoeener: 3607.05954953 hartree
cpcmener: -0.04160057 hartree
kineticenergy: 1758.13800226 hartree
xcener: -145.280108291574 hartree
chargesum: 0.0000000
charge: 0.863272 -0.510124 -0.499264 -0.274587 -0.443087 -0.461088 -0.290219 -0.291663 -0.205080 -0.141164 -0.429735 -0.425570 -0.221072 -0.044828 0.023985 -0.096775 -0.193290 -0.152713 -0.140806 0.492225 0.360786 0.372466 0.420240 0.414359 -0.322004 -0.122269 -0.120136 -0.115908 0.167764 0.162787 0.140688 0.201459 0.145341 0.162956 0.160829 0.189433 0.144782 0.128109 0.118492 0.114036 0.138791 0.110161 0.110149 0.131620 0.113142 0.113513
qa: 0.8633 -0.5101 -0.4993 -0.2746 -0.4431 -0.4611 -0.2902 -0.2917 -0.2051 -0.1412 -0.4297 -0.4256 -0.2211 -0.0448 0.0240 -0.0968 -0.1933 -0.1527 -0.1408 0.4922 0.3608 0.3725 0.4202 0.4144 -0.3220 -0.1223 -0.1201 -0.1159 0.1678 0.1628 0.1407 0.2015 0.1453 0.1630 0.1608 0.1894 0.1448 0.1281 0.1185 0.1140 0.1388 0.1102 0.1101 0.1316 0.1131 0.1135
va: 5.7326 1.9634 1.9957 2.1173 2.0561 2.0506 2.1420 2.1309 3.0510 3.1777 2.9761 2.9673 3.8184 3.6513 3.6643 3.8710 4.0014 3.9439 3.9191 4.0716 4.4170 4.2474 3.9920 4.0256 3.9300 3.8616 3.8456 3.8498 1.0326 1.0186 1.0054 1.0791 1.0171 0.9885 0.9893 1.0190 1.0164 0.9942 0.9942 0.9969 0.9950 0.9914 0.9994 0.9936 0.9959 0.9954
dispcorr: -0.025581107 hartree
energy: -1764.561212586144
dipole: -4.67807 2.65525 -2.02282 9.70634 -6.55736 3.14898 -3.17415 3.83263 0.65848
magnitude: 3.80019 au
magnitude: 9.65932 debye
