program: Orca
programVersion: 4.2.1
elementType: S O O O O O O O N N N N C C C C C C C C C C C C C C C C H H H H H H H H H H H H H H H H H H
charge: 0
multiplicity: 1
keywords: wb97x-d3
keywords: def2-TZVPP
keywords: def2/J RIJCOSX GRIDX6 NOFINALGRIDX
keywords: grid4 nofinalgrid
keywords: scfconv7
keywords: smallprint printgap noloewdin
keywords: NOSOSCF
formula: C16H18N4O7S
InChI: InChI=1S/C16H18N4O7S/c1-25-12-8-13(26-2)18-15(17-12)19-16(22)20-28(23,24)9-10-6-4-5-7-11(10)14(21)27-3/h4-8,19-20H,9H2,1-3H3
46 atoms
S  1.868476 -1.31455 0.687309
O  2.218372 -2.49935 1.443711
O  2.240361 -0.000411 1.184144
O  3.64239 2.415417 -0.4246
O  4.66227 0.458525 -0.740789
O  -0.17645 -3.314191 -0.216866
O  -5.939439 -0.089675 1.349744
O  -2.011644 2.343598 1.801175
N  0.213986 -1.200614 0.524782
N  -1.945921 -2.013258 0.301319
N  -3.940378 -1.053065 0.818894
N  -1.949159 0.186658 1.053775
C  2.466085 -1.52042 -0.990658
C  2.024829 -0.399577 -1.877851
C  2.576038 0.887117 -1.82194
C  0.975109 -0.641941 -2.756927
C  2.074049 1.887737 -2.64985
C  0.492475 0.352878 -3.593142
C  1.04593 1.621568 -3.540778
C  3.730955 1.20113 -0.934847
C  -0.595378 -2.248807 0.182975
C  -2.631334 -0.903717 0.746839
C  -4.626368 -0.003365 1.248324
C  -2.649193 1.232999 1.482162
C  -4.02796 1.200671 1.603939
C  4.708093 2.84922 0.419615
C  -6.577151 -1.317316 1.007242
C  -0.590548 2.381365 1.694688
H  2.085323 -2.48143 -1.336181
H  3.548592 -1.608993 -0.895255
H  0.534924 -1.630684 -2.796691
H  -0.241923 -0.325161 0.818589
H  2.498888 2.881982 -2.619761
H  -0.314037 0.134358 -4.280609
H  0.680458 2.406328 -4.189672
H  -2.528668 -2.800246 0.047395
H  -4.597691 2.04964 1.953136
H  4.456859 3.863275 0.718273
H  4.788399 2.223137 1.308476
H  5.66303 2.85541 -0.106372
H  -6.23446 -2.139889 1.635687
H  -7.637995 -1.154296 1.179554
H  -6.419552 -1.576373 -0.040034
H  -0.299683 3.38072 2.007981
H  -0.11537 1.65469 2.355855
H  -0.257074 2.224667 0.667062
elementType: S O N C H
totalener: -1764.53587965 hartree
nucrepener: 2997.79038962 hartree
electener: -4762.32626927 hartree
oneelecener: -8379.07011371 hartree
twoeener: 3616.74384444 hartree
cpcmener: -0.04186995 hartree
kineticenergy: 1758.12719736 hartree
xcener: -145.278514057632 hartree
chargesum: 0.0000000
charge: 0.861247 -0.497629 -0.512503 -0.274051 -0.443266 -0.459532 -0.291451 -0.289963 -0.198203 -0.139323 -0.427104 -0.430193 -0.225137 -0.042512 0.022724 -0.098814 -0.192367 -0.153646 -0.140269 0.490198 0.349971 0.374147 0.415027 0.419637 -0.323027 -0.121563 -0.116254 -0.119600 0.164548 0.168262 0.142782 0.204689 0.145546 0.163058 0.161883 0.189236 0.145694 0.127521 0.115046 0.117817 0.113726 0.131488 0.113375 0.138928 0.112821 0.107037
qa: 0.8612 -0.4976 -0.5125 -0.2741 -0.4433 -0.4595 -0.2915 -0.2900 -0.1982 -0.1393 -0.4271 -0.4302 -0.2251 -0.0425 0.0227 -0.0988 -0.1924 -0.1536 -0.1403 0.4902 0.3500 0.3741 0.4150 0.4196 -0.3230 -0.1216 -0.1163 -0.1196 0.1645 0.1683 0.1428 0.2047 0.1455 0.1631 0.1619 0.1892 0.1457 0.1275 0.1150 0.1178 0.1137 0.1315 0.1134 0.1389 0.1128 0.1070
va: 5.7349 1.9970 1.9613 2.1180 2.0555 2.0510 2.1317 2.1424 3.0520 3.1778 2.9670 2.9751 3.8203 3.6538 3.6620 3.8702 3.9986 3.9479 3.9190 4.0768 4.4231 4.2445 4.0248 3.9927 3.9283 3.8614 3.8495 3.8478 1.0168 1.0328 1.0053 1.0761 1.0172 0.9886 0.9888 1.0193 1.0163 0.9945 0.9960 0.9945 0.9956 0.9936 0.9956 0.9953 0.9970 0.9913
dispcorr: -0.025888292 hartree
energy: -1764.561767944815
dipole: -4.29602 1.47364 -2.82238 10.22473 -7.89869 2.32604 -3.66853 2.25070 -1.41783
magnitude: 3.92257 au
magnitude: 9.97037 debye
