program: Orca
programVersion: 4.2.1
elementType: S O O O O O O O N N N N C C C C C C C C C C C C C C C C H H H H H H H H H H H H H H H H H H
charge: 0
multiplicity: 1
keywords: wb97x-d3
keywords: def2-TZVPP
keywords: def2/J RIJCOSX GRIDX6 NOFINALGRIDX
keywords: grid4 nofinalgrid
keywords: scfconv7
keywords: smallprint printgap noloewdin
keywords: NOSOSCF
formula: C16H18N4O7S
InChI: InChI=1S/C16H18N4O7S/c1-25-12-8-13(26-2)18-15(17-12)19-16(22)20-28(23,24)9-10-6-4-5-7-11(10)14(21)27-3/h4-8,19-20H,9H2,1-3H3
46 atoms
S  1.400647 -1.801919 -0.559719
O  0.917794 -1.393624 -1.867995
O  1.590523 -3.208485 -0.2693
O  1.987414 0.99355 -3.716098
O  3.612817 -0.36096 -3.011546
O  1.177354 -1.859326 2.437536
O  -3.398539 0.672971 -1.033284
O  -5.139609 0.479208 3.266142
N  0.276032 -1.14114 0.477358
N  -0.882969 -0.938192 2.474151
N  -2.128195 -0.122658 0.688434
N  -3.003245 -0.218866 2.87462
C  2.924265 -0.938652 -0.174742
C  2.767678 0.545302 -0.278817
C  2.662093 1.224341 -1.499427
C  2.667457 1.270624 0.90332
C  2.469751 2.603231 -1.505838
C  2.497376 2.646147 0.890656
C  2.399748 3.314689 -0.318588
C  2.810102 0.515241 -2.801328
C  0.257589 -1.357085 1.827675
C  -2.052472 -0.401987 1.978422
C  -3.276388 0.381445 0.247814
C  -4.143657 0.283095 2.422678
C  -4.352266 0.612621 1.087854
C  2.048127 0.413846 -5.018727
C  -2.298911 0.426655 -1.906477
C  -4.956973 0.138679 4.637602
H  3.662212 -1.353851 -0.861658
H  3.202827 -1.242602 0.833776
H  2.734324 0.750095 1.850716
H  -0.551439 -0.689581 0.061873
H  2.395003 3.136031 -2.444141
H  2.438894 3.189899 1.824186
H  2.268466 4.388162 -0.342425
H  -0.877493 -1.097213 3.473258
H  -5.287311 1.01937 0.731184
H  1.80157 -0.647685 -4.992198
H  1.304935 0.938945 -5.612389
H  3.030163 0.546671 -5.473207
H  -2.035451 -0.63106 -1.93615
H  -2.634955 0.731071 -2.894225
H  -1.425637 1.02113 -1.634417
H  -5.90088 0.368953 5.124722
H  -4.73731 -0.921381 4.765077
H  -4.163443 0.727738 5.097497
elementType: S O N C H
totalener: -1764.53578785 hartree
nucrepener: 2997.43815562 hartree
electener: -4761.97394348 hartree
oneelecener: -8378.38724551 hartree
twoeener: 3616.41330203 hartree
cpcmener: -0.04161348 hartree
kineticenergy: 1758.14237699 hartree
xcener: -145.281216758177 hartree
chargesum: -0.0000000
charge: 0.860701 -0.510819 -0.499471 -0.273630 -0.442518 -0.460299 -0.290126 -0.291722 -0.197741 -0.140114 -0.429200 -0.425858 -0.220619 -0.047139 0.025457 -0.097683 -0.193894 -0.154753 -0.139565 0.491312 0.351799 0.373138 0.419884 0.414870 -0.321888 -0.122485 -0.119678 -0.115687 0.166991 0.163325 0.142733 0.202163 0.145179 0.163615 0.161494 0.189519 0.144919 0.114626 0.127858 0.118439 0.110552 0.138760 0.109452 0.131609 0.113184 0.113308
qa: 0.8607 -0.5108 -0.4995 -0.2736 -0.4425 -0.4603 -0.2901 -0.2917 -0.1977 -0.1401 -0.4292 -0.4259 -0.2206 -0.0471 0.0255 -0.0977 -0.1939 -0.1548 -0.1396 0.4913 0.3518 0.3731 0.4199 0.4149 -0.3219 -0.1225 -0.1197 -0.1157 0.1670 0.1633 0.1427 0.2022 0.1452 0.1636 0.1615 0.1895 0.1449 0.1146 0.1279 0.1184 0.1106 0.1388 0.1095 0.1316 0.1132 0.1133
va: 5.7327 1.9622 1.9953 2.1159 2.0571 2.0507 2.1423 2.1313 3.0498 3.1769 2.9773 2.9679 3.8181 3.6481 3.6627 3.8642 4.0014 3.9509 3.9203 4.0740 4.4223 4.2464 3.9922 4.0252 3.9296 3.8608 3.8462 3.8496 1.0325 1.0182 1.0062 1.0790 1.0171 0.9884 0.9891 1.0190 1.0165 0.9966 0.9943 0.9945 0.9986 0.9950 0.9918 0.9936 0.9959 0.9956
dispcorr: -0.025860614 hartree
energy: -1764.561648464988
dipole: -4.57389 2.56964 -2.00425 10.23032 -7.01894 3.21138 -2.68805 3.47370 0.78565
magnitude: 3.86617 au
magnitude: 9.82701 debye
