program: Orca
programVersion: 4.2.1
elementType: S O O O O O O O N N N N C C C C C C C C C C C C C C C C H H H H H H H H H H H H H H H H H H
charge: 0
multiplicity: 1
keywords: wb97x-d3
keywords: def2-TZVPP
keywords: def2/J RIJCOSX GRIDX6 NOFINALGRIDX
keywords: grid4 nofinalgrid
keywords: scfconv7
keywords: smallprint printgap noloewdin
keywords: NOSOSCF
formula: C16H18N4O7S
InChI: InChI=1S/C16H18N4O7S/c1-25-12-8-13(26-2)18-15(17-12)19-16(22)20-28(23,24)9-10-6-4-5-7-11(10)14(21)27-3/h4-8,19-20H,9H2,1-3H3
46 atoms
S  2.458057 -1.186233 1.255851
O  2.993687 -2.518733 1.432321
O  2.61345 -0.197027 2.305949
O  1.414023 -0.80891 -2.691887
O  -0.594366 0.014275 -2.187874
O  0.686491 -3.123051 -0.278682
O  -5.159295 0.265204 -0.265664
O  -1.566723 2.278863 1.881897
N  0.810914 -1.248979 1.017894
N  -1.207498 -1.969016 0.145117
N  -3.191141 -0.86717 -0.042268
N  -1.386519 0.150069 1.080021
C  3.090697 -0.510447 -0.288671
C  2.505681 0.844599 -0.548245
C  1.334605 1.070492 -1.287122
C  3.107845 1.928854 0.086537
C  0.784572 2.350759 -1.336586
C  2.578832 3.20546 -0.002994
C  1.403406 3.416254 -0.707007
C  0.606425 0.038361 -2.078739
C  0.149439 -2.181296 0.260922
C  -1.954472 -0.841864 0.416093
C  -3.911846 0.225212 0.164968
C  -2.109991 1.249204 1.259275
C  -3.416106 1.352514 0.812091
C  0.82102 -1.818024 -3.513211
C  -5.686277 -0.865702 -0.953392
C  -0.233058 2.162006 2.37111
H  2.903296 -1.256497 -1.056693
H  4.171698 -0.454889 -0.140755
H  4.011589 1.769311 0.659971
H  0.246116 -0.458683 1.367815
H  -0.127563 2.517572 -1.893426
H  3.076488 4.029615 0.490494
H  0.970508 4.405486 -0.770347
H  -1.689476 -2.671771 -0.399925
H  -4.009614 2.24286 0.959978
H  0.145892 -2.457599 -2.947172
H  0.284515 -1.374301 -4.351347
H  1.647203 -2.413599 -3.889661
H  -6.706398 -0.598707 -1.217107
H  -5.126143 -1.082454 -1.86315
H  -5.700619 -1.753497 -0.320919
H  -0.160353 1.408927 3.156889
H  0.476249 1.93521 1.575445
H  0.013586 3.133819 2.790523
elementType: S O N C H
totalener: -1764.53008401 hartree
nucrepener: 3161.87581890 hartree
electener: -4926.40590291 hartree
oneelecener: -8707.34160821 hartree
twoeener: 3780.93570530 hartree
cpcmener: -0.04104822 hartree
kineticenergy: 1758.14191943 hartree
xcener: -145.283940688614 hartree
chargesum: 0.0000000
charge: 0.853758 -0.491423 -0.508379 -0.270262 -0.425405 -0.435925 -0.291309 -0.290322 -0.196823 -0.137953 -0.412249 -0.400360 -0.209069 -0.051941 0.070790 -0.094914 -0.156686 -0.134810 -0.156959 0.408223 0.301137 0.352848 0.411594 0.407136 -0.321685 -0.122370 -0.117179 -0.073465 0.169014 0.157264 0.137951 0.210107 0.136654 0.160451 0.158866 0.190290 0.144009 0.108338 0.125616 0.132521 0.131477 0.113095 0.113276 0.138262 0.025730 0.141080
qa: 0.8538 -0.4914 -0.5084 -0.2703 -0.4254 -0.4359 -0.2913 -0.2903 -0.1968 -0.1380 -0.4122 -0.4004 -0.2091 -0.0519 0.0708 -0.0949 -0.1567 -0.1348 -0.1570 0.4082 0.3011 0.3528 0.4116 0.4071 -0.3217 -0.1224 -0.1172 -0.0735 0.1690 0.1573 0.1380 0.2101 0.1367 0.1605 0.1589 0.1903 0.1440 0.1083 0.1256 0.1325 0.1315 0.1131 0.1133 0.1383 0.0257 0.1411
va: 5.7632 2.0035 1.9709 2.1436 2.0593 2.0702 2.1310 2.1311 3.0437 3.1834 2.9544 2.9533 3.8461 3.6857 3.4891 3.8943 3.8838 3.9022 3.8903 4.0775 4.4642 4.2544 4.0305 3.9812 3.9387 3.8576 3.8511 3.8390 1.0281 1.0149 1.0082 1.0830 1.0223 0.9899 0.9915 1.0185 1.0169 1.0001 0.9944 0.9929 0.9935 0.9961 0.9956 0.9977 1.0013 0.9974
dispcorr: -0.032455466 hartree
energy: -1764.562539473837
dipole: -5.26123 4.14164 -1.11959 6.93986 -4.78010 2.15976 -7.47296 5.91054 -1.56242
magnitude: 2.89123 au
magnitude: 7.34892 debye
