program: Orca
programVersion: 4.2.1
elementType: S O O O O O O O N N N N C C C C C C C C C C C C C C C C H H H H H H H H H H H H H H H H H H
charge: 0
multiplicity: 1
keywords: wb97x-d3
keywords: def2-TZVPP
keywords: def2/J RIJCOSX GRIDX6 NOFINALGRIDX
keywords: grid4 nofinalgrid
keywords: scfconv7
keywords: smallprint printgap noloewdin
keywords: NOSOSCF
formula: C16H18N4O7S
InChI: InChI=1S/C16H18N4O7S/c1-25-12-8-13(26-2)18-15(17-12)19-16(22)20-28(23,24)9-10-6-4-5-7-11(10)14(21)27-3/h4-8,19-20H,9H2,1-3H3
46 atoms
S  1.279522 -2.689119 -0.531768
O  0.203952 -3.266422 -1.31593
O  2.213442 -3.551446 0.159046
O  2.940434 1.082381 -0.444628
O  1.063083 2.026177 0.298374
O  2.212358 -1.230514 1.967197
O  -3.304812 0.043175 -0.65398
O  -2.908889 3.065599 2.848643
N  0.485763 -1.704929 0.552316
N  0.232361 -0.190457 2.284606
N  -1.573436 -0.124881 0.824497
N  -1.349734 1.419127 2.590102
C  2.21131 -1.540269 -1.560864
C  1.293515 -0.552033 -2.213549
C  0.975218 0.702901 -1.672772
C  0.630393 -0.963396 -3.368042
C  -0.019725 1.478895 -2.265885
C  -0.325365 -0.166683 -3.976338
C  -0.665515 1.05351 -3.413157
C  1.642264 1.324646 -0.493447
C  1.064857 -1.06369 1.617345
C  -0.953854 0.383611 1.875467
C  -2.672685 0.496973 0.412575
C  -2.457938 2.019077 2.181636
C  -3.178651 1.608043 1.064824
C  3.684842 1.657672 0.63207
C  -2.797744 -1.113583 -1.313515
C  -2.175791 3.530429 3.978064
H  2.704363 -2.176569 -2.299503
H  2.985589 -1.113458 -0.928971
H  0.868492 -1.926994 -3.798868
H  -0.48064 -1.425877 0.321219
H  -0.277111 2.436148 -1.832854
H  -0.815955 -0.509159 -4.877659
H  -1.425724 1.67565 -3.865935
H  0.668911 0.26804 3.073883
H  -4.072829 2.116061 0.734315
H  3.658952 2.745518 0.590482
H  3.319054 1.321818 1.600378
H  4.706677 1.317689 0.49802
H  -2.849318 -1.995161 -0.673136
H  -3.439997 -1.26713 -2.176764
H  -1.775243 -0.969253 -1.660763
H  -2.717355 4.40046 4.340295
H  -2.132608 2.780847 4.768414
H  -1.16189 3.826212 3.708267
elementType: S O N C H
totalener: -1764.52917674 hartree
nucrepener: 3170.70046815 hartree
electener: -4935.22964489 hartree
oneelecener: -8724.95207722 hartree
twoeener: 3789.72243233 hartree
cpcmener: -0.04074067 hartree
kineticenergy: 1758.14466136 hartree
xcener: -145.283923323348 hartree
chargesum: 0.0000000
charge: 0.853386 -0.508781 -0.491543 -0.271122 -0.421746 -0.434131 -0.290499 -0.292126 -0.194090 -0.142055 -0.398689 -0.408495 -0.208536 -0.058470 0.065016 -0.090431 -0.153961 -0.142344 -0.152081 0.411808 0.297778 0.348397 0.404996 0.412515 -0.320684 -0.120864 -0.080685 -0.117204 0.158000 0.169189 0.137372 0.211147 0.138517 0.160337 0.158846 0.189886 0.145024 0.124657 0.109303 0.132096 0.139634 0.141841 0.030802 0.131661 0.113047 0.113284
qa: 0.8534 -0.5088 -0.4915 -0.2711 -0.4217 -0.4341 -0.2905 -0.2921 -0.1941 -0.1421 -0.3987 -0.4085 -0.2085 -0.0585 0.0650 -0.0904 -0.1540 -0.1423 -0.1521 0.4118 0.2978 0.3484 0.4050 0.4125 -0.3207 -0.1209 -0.0807 -0.1172 0.1580 0.1692 0.1374 0.2111 0.1385 0.1603 0.1588 0.1899 0.1450 0.1247 0.1093 0.1321 0.1396 0.1418 0.0308 0.1317 0.1130 0.1133
va: 5.7631 1.9712 2.0031 2.1433 2.0630 2.0727 2.1287 2.1307 3.0496 3.1823 2.9513 2.9513 3.8418 3.6899 3.4980 3.8808 3.8893 3.9040 3.8844 4.0759 4.4727 4.2622 3.9787 4.0312 3.9383 3.8557 3.8375 3.8513 1.0146 1.0290 1.0094 1.0806 1.0218 0.9907 0.9915 1.0190 1.0166 0.9944 1.0005 0.9930 0.9970 0.9969 1.0009 0.9932 0.9954 0.9963
dispcorr: -0.032805383 hartree
energy: -1764.561982119762
dipole: -2.17846 1.28444 -0.89402 11.08771 -8.50401 2.58370 -2.70862 1.59260 -1.11602
magnitude: 2.95301 au
magnitude: 7.50596 debye
