program: Gaussian 09
title: 000074065
version: EM64L-G09RevD.01
frameworkgroup: C1[X(C8H9NO3S)]
method: RPBEPBE
basis: SDD
operation: Freq
keyword: #p
keyword: freq=noraman
keyword: PBEPBE/SDD
title: #p freq=noraman PBEPBE/SDD
converged: NO NO NO NO
title: Mulliken charges:
elementType: S O O O N C C C C C C C C H H H H H H H H H
charge: 0.949073 -0.536467 -0.532409 -0.212291 -0.719678 -0.028587 0.314443 -0.246753 -0.238818 -0.322298 -0.327716 0.137459 -0.785852 0.287894 0.287634 0.255565 0.290800 0.339073 0.338886 0.240945 0.242544 0.266553
chargesum: 0.00000
title: Mulliken charges with hydrogens summed into heavy atoms:
elementType: S O O O N C C C C C C C C
charge: 0.949073 -0.536467 -0.532409 -0.212291 -0.041719 -0.028587 0.314443 0.041141 0.048816 -0.066733 -0.036916 0.137459 -0.035809
polarizability: 1.84268544e+02 -1.46232131e+00 1.27612269e+02 -2.35265417e+00 6.98594558e-02 7.55897511e+01
1716.lowfreq: -5.5384 -0.0011 0.0031 0.0031 4.1245 12.5320 31.8487 63.5452 67.3821
frequency: 31.0946 63.5233 67.3632 112.7191 115.6019 151.0693 156.1025 204.9452 210.4586 261.8578 271.6716 332.7383 349.4266 371.1208 406.4210 435.2358 458.3723 490.8081 504.6521 589.4828 595.7921 616.3006 727.0367 741.6728 794.5088 806.5418 848.1213 869.7141 906.2985 948.8008 979.0363 994.9961 1005.0596 1031.1879 1050.4092 1070.2563 1071.4111 1115.8964 1181.6170 1265.4205 1293.2222 1373.2381 1389.2326 1391.5366 1446.9029 1463.0052 1466.8409 1537.1562 1576.6230 1590.2192 1612.1200 2985.6028 3069.2516 3127.1438 3151.3870 3153.4373 3168.0154 3171.3817 3368.2482 3534.4112
redmass: 4.6282 5.1042 4.2745 6.3185 1.5655 4.0513 1.1156 5.4556 8.8541 7.7120 2.3116 7.5599 5.2417 6.5285 2.8387 5.1824 3.5283 5.8210 3.7988 4.2163 2.4645 7.0918 4.7520 3.5757 2.4769 3.5562 1.3346 1.3498 4.0965 2.2311 1.3661 5.1561 1.3811 1.8224 2.9201 1.9360 1.6430 1.3370 1.1328 3.9831 1.2543 1.3499 6.6146 2.9939 1.0982 1.0493 2.2242 1.0854 7.2647 6.2482 8.0925 1.0380 1.0969 1.0990 1.0882 1.0884 1.0964 1.0977 1.0416 1.1002
irintensity: 1.3007 1.3624 6.1839 1.4999 39.1190 2.6120 0.2152 9.7228 0.4812 2.1926 4.4908 0.9924 0.5237 45.9601 0.0373 34.2240 65.8052 7.0642 125.1842 36.2676 30.2574 0.4271 10.9903 2.7853 32.5499 203.4178 25.9808 33.4699 60.3146 25.2087 0.0875 3.6300 1.4577 0.6233 29.8089 6.3284 22.9397 2.8014 2.8621 209.1648 1.1787 30.5300 13.6799 60.2590 26.9166 22.5642 0.4244 22.3869 89.0625 17.1841 59.1581 2.7150 10.1105 14.7350 2.8889 3.6860 3.6880 1.5081 32.2789 27.4678
temp: 298.150 k
press: 1.00000 atm
elementType: 16 8 8 8 7 6 6 6 6 6 6 6 6 1 1 1 1 1 1 1 1 1
symmnumber: 1
zpe: 413152.6 jmol-1
zpe.correction: 0.157362 hartree
zpe.thermalcorrener: 0.171172 hartree
zpe.thermalcorrenthalpy: 0.172116 hartree
zpe.thermalcorrgfe: 0.115988 hartree
zpe.sumelectzpe: -987.593060 hartree
zpe.sumelectthermal: -987.579250 hartree
zpe.sumelectthermalent: -987.578306 hartree
zpe.sumelectthermalfe: -987.634434 hartree
dipole: 1.2031 2.4747 2.9440
dipole: 4.0297
quadrupole: -90.6173 -82.8797 -86.6064
quadrupole: 12.6108 -14.2869 0.2666
quadrupole: -3.9162 3.8214 0.0948 12.6108 -14.2869 0.2666
hfenergy: -987.750422 hartree
pointgroup: C01[X(C8H9N1O3S1)]
dipole: -0.4849019 0.9845834 -1.1441242 debye
dipolederiv: 2.1653017 -0.0002037 -0.2532722 0.0018412 1.1851923 0.0019901 -0.2261136 0.0015235 1.5873427 -0.7705062 -0.0610092 0.0193704 -0.0949713 -0.6082473 -0.1703735 0.0298602 0.0033629 -0.5385802 -0.7703423 0.0606942 0.0144933 0.093332 -0.5947168 0.174111 0.0275757 0.0008614 -0.5444601 -0.9382315 -0.1149005 0.003614 -0.2853228 -0.7058261 -0.0044515 -0.0059042 -0.0068396 -0.3050775 -0.7349887 0.0012888 0.0770513 0.0023982 -0.3636669 -0.0071484 0.1822849 -0.0056391 -0.9038409 0.0405012 0.0052458 -0.0475061 -0.0181506 -0.0159845 0.0010376 -0.1551754 0.0011022 -0.1517492 -0.7056088 0.0414029 0.0094609 0.1035853 -0.0520052 -0.0020001 -0.0036065 -0.0022467 0.0053276 -0.3399087 0.1897991 0.0211798 -0.075345 -0.0545137 -0.0021271 0.016565 0.0226374 -0.0884965 -0.2894803 -0.212899 0.0209839 0.1081219 -0.0393498 0.0029452 0.0184363 -0.0230951 -0.0891558 0.08018 -0.1736731 -0.0028367 0.1135011 0.0195709 0.0008891 0.0178007 0.0027394 -0.1169164 -0.0071544 0.1922771 -0.0013061 -0.1495267 0.0210582 0.0006385 0.013803 0.0003639 -0.0841066 1.7614218 -0.0786842 -0.0103911 -0.0891899 0.9108898 0.0130836 0.005251 0.0117301 0.1248838 -0.2414568 0.1829968 0.0041159 0.3230339 -0.3754917 -0.0080536 0.0039746 -0.0064373 0.0445144 0.114541 -0.0624667 -0.0073517 -0.0372482 0.0671857 0.0031895 -0.0017734 -0.0078894 0.1545943 0.1036086 0.0674697 -0.0066961 0.0396781 0.0707464 -0.0045615 -0.0019724 0.0069194 0.1532197 0.0288312 0.0791424 0.0009848 0.0866933 -0.0146472 -0.0025493 -0.0041026 -0.0025802 0.1441998 0.0856114 -0.0648437 0.0000753 -0.0114678 0.043733 0.0008006 -0.0045853 0.0007406 0.1550618 0.1696037 -0.0659839 0.0803064 -0.0175976 0.1510816 -0.0993348 0.0451236 -0.0519044 0.1822895 0.1711536 0.0673564 0.0780485 0.0188582 0.1546407 0.0996718 0.0454184 0.0519264 0.1771493 0.0893664 -0.0294437 0.0825379 -0.0235515 0.0503819 0.0704187 0.0559758 0.0846325 -0.0140488 0.0900116 -0.02623 -0.0827587 -0.0224564 0.0559423 -0.0675851 -0.0566495 -0.0815945 -0.0171884 -0.1024547 0.0026646 -0.0001037 -0.0662154 0.0940264 -0.0005908 -0.0021865 -0.0003137 0.1250374 unknown
polarizability: 184.1525643|0.7691846|127.5839353|-4.5953443|0.1743372|75.7340642 unknown
InChI: InChI=1S/C8H9NO3S/c1-6(10)7-2-4-8(5-3-7)13(9,11)12/h2-5H,9H2,1H3
charge 0 multiplicity 1
22 atoms
S  2.917348 0.021157 0.056184
O  3.381225 1.475349 0.627851
O  3.41124 -1.398211 0.684927
O  -3.845998 -1.199365 -0.021955
N  3.364767 -0.006347 -1.724209
C  1.032848 0.003521 0.017033
C  -1.751252 -0.0139 0.003887
C  0.365674 1.237735 0.024642
C  0.38047 -1.241122 0.016579
C  -1.045732 1.218905 0.018542
C  -1.027809 -1.238025 0.008588
C  -3.260371 -0.078798 -0.003986
C  -4.055474 1.220475 0.013393
H  0.932402 2.173559 0.059568
H  0.956526 -2.171369 0.046592
H  -1.588887 2.168866 0.02788
H  -1.596411 -2.173549 0.008874
H  3.898187 0.85279 -1.938071
H  3.894892 -0.873257 -1.913456
H  -3.818623 1.845322 -0.86816
H  -3.823939 1.817898 0.915109
H  -5.129585 0.982065 0.006487
