program: Orca
programVersion: 4.2.1
elementType: S O O O O O O O N N N N C C C C C C C C C C C C C C C C H H H H H H H H H H H H H H H H H H
charge: 0
multiplicity: 1
keywords: wb97x-d3
keywords: def2-TZVPP
keywords: def2/J RIJCOSX GRIDX6 NOFINALGRIDX
keywords: grid4 nofinalgrid
keywords: scfconv7
keywords: smallprint printgap noloewdin
keywords: NOSOSCF
formula: C16H18N4O7S
InChI: InChI=1S/C16H18N4O7S/c1-25-12-8-13(26-2)18-15(17-12)19-16(22)20-28(23,24)9-10-6-4-5-7-11(10)14(21)27-3/h4-8,19-20H,9H2,1-3H3
46 atoms
S  2.248914 -1.649502 0.647625
O  2.870552 -2.912642 0.978982
O  2.749151 -0.419165 1.236677
O  2.630524 2.523125 -0.103654
O  3.814094 1.04308 -1.279482
O  0.056651 -3.672228 0.206805
O  -5.05037 0.667345 -0.242096
O  -1.163328 2.306192 1.688219
N  0.638897 -1.653271 1.090479
N  -1.571609 -2.156003 0.589775
N  -3.31746 -0.751657 0.196594
N  -1.345031 0.083414 1.183571
C  2.203496 -1.475364 -1.148418
C  1.224791 -0.417002 -1.556225
C  1.431357 0.953517 -1.342124
C  0.002943 -0.83487 -2.073631
C  0.405907 1.855767 -1.614927
C  -1.004346 0.071453 -2.369153
C  -0.806379 1.4205 -2.127774
C  2.754414 1.480743 -0.904503
C  -0.259361 -2.572533 0.603823
C  -2.09248 -0.878818 0.670376
C  -3.830407 0.470186 0.223339
C  -1.868791 1.305702 1.196729
C  -3.139894 1.570993 0.715695
C  3.828698 3.142312 0.362464
C  -5.768882 -0.439614 -0.779186
C  0.095164 2.036117 2.299139
H  1.923874 -2.450676 -1.546507
H  3.234558 -1.279014 -1.441235
H  -0.163632 -1.889744 -2.254901
H  0.243974 -0.737525 1.351485
H  0.555649 2.913928 -1.449805
H  -1.9400 -0.281517 -2.781671
H  -1.587873 2.136539 -2.34386
H  -2.215784 -2.848187 0.228989
H  -3.565789 2.563522 0.730034
H  4.430304 3.52515 -0.461441
H  3.510345 3.970706 0.988825
H  4.425344 2.450833 0.957137
H  -5.255261 -0.876806 -1.635847
H  -5.939627 -1.213466 -0.03045
H  -6.725447 -0.037832 -1.103077
H  0.472409 2.999103 2.633398
H  -0.013645 1.378017 3.16207
H  0.808209 1.604401 1.599175
elementType: S O N C H
totalener: -1764.52993177 hartree
nucrepener: 3172.89520614 hartree
electener: -4937.42513792 hartree
oneelecener: -8728.53079688 hartree
twoeener: 3791.10565896 hartree
cpcmener: -0.04370733 hartree
kineticenergy: 1758.14132360 hartree
xcener: -145.283982050320 hartree
chargesum: 0.0000000
charge: 0.860506 -0.492159 -0.509205 -0.266439 -0.438346 -0.431993 -0.290410 -0.288657 -0.184533 -0.130050 -0.399083 -0.388433 -0.200186 -0.051929 -0.012752 -0.102871 -0.164477 -0.116001 -0.151397 0.473649 0.282782 0.292697 0.423334 0.420094 -0.329477 -0.121323 -0.116681 -0.097985 0.161226 0.165586 0.155101 0.205648 0.143173 0.159076 0.156184 0.191075 0.140058 0.121414 0.123486 0.117198 0.111536 0.113873 0.132327 0.138120 0.136444 0.059799
qa: 0.8605 -0.4922 -0.5092 -0.2664 -0.4383 -0.4320 -0.2904 -0.2887 -0.1845 -0.1300 -0.3991 -0.3884 -0.2002 -0.0519 -0.0128 -0.1029 -0.1645 -0.1160 -0.1514 0.4736 0.2828 0.2927 0.4233 0.4201 -0.3295 -0.1213 -0.1167 -0.0980 0.1612 0.1656 0.1551 0.2056 0.1432 0.1591 0.1562 0.1911 0.1401 0.1214 0.1235 0.1172 0.1115 0.1139 0.1323 0.1381 0.1364 0.0598
va: 5.7400 2.0016 1.9602 2.1143 2.0646 2.0747 2.1317 2.1238 3.0563 3.1566 2.9278 2.9297 3.8009 3.6470 3.6309 3.7943 3.8847 3.8284 3.8844 4.0863 4.4919 4.3160 3.9926 3.9441 3.9321 3.8582 3.8538 3.8468 1.0203 1.0322 1.0010 1.0833 1.0203 0.9942 0.9926 1.0173 1.0195 0.9949 0.9952 0.9956 0.9946 0.9954 0.9935 0.9956 0.9939 0.9951
dispcorr: -0.033628498 hartree
energy: -1764.563560271848
dipole: -7.26292 3.73401 -3.52891 11.97812 -9.30157 2.67655 -3.39076 2.42213 -0.96864
magnitude: 4.53380 au
magnitude: 11.52401 debye
