program: Orca
programVersion: 4.2.1
elementType: S O O O O O O O N N N N C C C C C C C C C C C C C C C C H H H H H H H H H H H H H H H H H H
charge: 0
multiplicity: 1
keywords: wb97x-d3
keywords: def2-TZVPP
keywords: def2/J RIJCOSX GRIDX6 NOFINALGRIDX
keywords: grid4 nofinalgrid
keywords: scfconv7
keywords: smallprint printgap noloewdin
keywords: NOSOSCF
formula: C16H18N4O7S
InChI: InChI=1S/C16H18N4O7S/c1-25-12-8-13(26-2)18-15(17-12)19-16(22)20-28(23,24)9-10-6-4-5-7-11(10)14(21)27-3/h4-8,19-20H,9H2,1-3H3
46 atoms
S  1.127383 -0.960624 -0.032594
O  1.44902 -2.305888 0.374094
O  1.623332 0.178893 0.71628
O  4.119621 2.329516 -0.557002
O  2.273567 2.060769 -1.773765
O  -1.154414 -2.520135 -1.282963
O  -6.442008 -0.006077 2.129899
O  -2.386329 2.17907 2.720385
N  -0.535418 -0.726471 -0.019353
N  -2.746376 -1.440867 -0.105347
N  -4.592167 -0.724007 1.00779
N  -2.534715 0.39042 1.311447
C  1.548989 -0.766486 -1.770792
C  3.041348 -0.820648 -1.895639
C  3.87051 0.279876 -1.642058
C  3.622592 -2.04847 -2.188524
C  5.252583 0.12341 -1.7106
C  4.996952 -2.190717 -2.272743
C  5.814849 -1.09937 -2.034714
C  3.308876 1.628021 -1.340847
C  -1.433279 -1.631083 -0.518803
C  -3.302347 -0.547461 0.779461
C  -5.15613 0.121617 1.856644
C  -3.114204 1.230279 2.162795
C  -4.458612 1.147079 2.485936
C  3.693279 3.637811 -0.207811
C  -7.164008 -1.058963 1.510558
C  -1.006977 2.270357 2.389089
H  1.118264 0.171359 -2.109706
H  1.073311 -1.597567 -2.290274
H  2.983547 -2.906822 -2.349274
H  -0.893217 -0.002052 0.611702
H  5.899366 0.966367 -1.51376
H  5.426028 -3.154009 -2.513354
H  6.890347 -1.198332 -2.093179
H  -3.395577 -2.111165 -0.489044
H  -4.930216 1.827921 3.177461
H  2.744486 3.614763 0.327896
H  4.466228 4.040119 0.44105
H  3.585364 4.275963 -1.085371
H  -6.756483 -2.036313 1.770113
H  -8.180118 -0.978175 1.887119
H  -7.169727 -0.962049 0.424624
H  -0.455434 1.373211 2.672539
H  -0.854807 2.456537 1.325035
H  -0.625999 3.114975 2.956283
totalener: -1764.50704333 hartree
nucrepener: 2902.25002156 hartree
electener: -4666.75706489 hartree
oneelecener: -8187.81461973 hartree
twoeener: 3521.05755484 hartree
kineticenergy: 1758.19599268 hartree
xcener: -145.280541383496 hartree
chargesum: -0.0000000
charge: 0.857941 -0.422618 -0.487634 -0.263192 -0.383003 -0.386870 -0.263363 -0.262172 -0.247184 -0.169218 -0.406746 -0.429846 -0.225841 -0.070393 0.015997 -0.068338 -0.150252 -0.117453 -0.119735 0.442834 0.356847 0.362463 0.387300 0.399166 -0.302378 -0.131008 -0.124562 -0.131725 0.163152 0.157423 0.116526 0.194965 0.123836 0.131848 0.127815 0.168043 0.129319 0.109964 0.117055 0.110810 0.109051 0.123819 0.107870 0.112366 0.110294 0.126827
qa: 0.8579 -0.4226 -0.4876 -0.2632 -0.3830 -0.3869 -0.2634 -0.2622 -0.2472 -0.1692 -0.4067 -0.4298 -0.2258 -0.0704 0.0160 -0.0683 -0.1503 -0.1175 -0.1197 0.4428 0.3568 0.3625 0.3873 0.3992 -0.3024 -0.1310 -0.1246 -0.1317 0.1632 0.1574 0.1165 0.1950 0.1238 0.1318 0.1278 0.1680 0.1293 0.1100 0.1171 0.1108 0.1091 0.1238 0.1079 0.1124 0.1103 0.1268
va: 5.7394 2.0721 1.9971 2.1202 2.1093 2.1246 2.1508 2.1608 3.0637 3.1655 2.9722 2.9734 3.8377 3.8509 3.7670 3.9698 4.0235 3.9720 3.9685 4.1009 4.4022 4.2470 4.0560 4.0210 3.9380 3.8995 3.8756 3.8670 1.0350 1.0158 1.0121 1.0769 1.0267 0.9987 1.0006 1.0358 1.0217 0.9948 0.9947 0.9948 0.9970 0.9939 0.9968 0.9999 0.9940 0.9956
dispcorr: -0.023751308 hartree
energy: -1764.530794640222
dipole: 0.88290 -1.57243 -0.68953 7.54195 -6.56330 0.97865 0.49485 -0.43104 0.06381
magnitude: 1.19886 au
magnitude: 3.04727 debye
