program: Orca
programVersion: 4.2.1
elementType: S O O O O O O O N N N N C C C C C C C C C C C C C C C C H H H H H H H H H H H H H H H H H H
charge: 0
multiplicity: 1
keywords: wb97x-d3
keywords: def2-TZVPP
keywords: def2/J RIJCOSX GRIDX6 NOFINALGRIDX
keywords: grid4 nofinalgrid
keywords: scfconv7
keywords: smallprint printgap noloewdin
keywords: NOSOSCF
formula: C16H18N4O7S
InChI: InChI=1S/C16H18N4O7S/c1-25-12-8-13(26-2)18-15(17-12)19-16(22)20-28(23,24)9-10-6-4-5-7-11(10)14(21)27-3/h4-8,19-20H,9H2,1-3H3
46 atoms
S  1.542962 -1.028753 0.070068
O  2.304634 -2.176512 0.490009
O  1.980351 0.315367 0.395023
O  2.736718 2.796437 -1.95346
O  0.811342 1.688637 -2.10132
O  -0.564128 -3.223386 0.140775
O  -2.006742 2.547498 2.129209
O  -5.728759 -0.031895 3.164468
N  -0.007371 -1.081679 0.701388
N  -2.079436 -1.969777 1.249136
N  -2.00832 0.306467 1.707971
N  -3.900847 -1.007977 2.213032
C  1.246764 -1.146423 -1.705493
C  2.49279 -0.75687 -2.438554
C  2.867008 0.577221 -2.652542
C  3.339669 -1.771388 -2.868035
C  4.058736 0.851565 -3.318977
C  4.517067 -1.488766 -3.539612
C  4.873665 -0.171582 -3.772276
C  2.0105 1.713204 -2.203449
C  -0.837218 -2.167715 0.652087
C  -2.67621 -0.835499 1.745918
C  -2.630425 1.385693 2.168855
C  -4.504124 0.074487 2.680782
C  -3.914222 1.334162 2.686394
C  2.039151 3.949576 -1.510215
C  -0.702849 2.607288 1.563908
C  -6.348907 -1.307968 3.163621
H  0.403437 -0.502497 -1.937603
H  0.975084 -2.184492 -1.894958
H  3.067776 -2.800229 -2.670374
H  -0.395436 -0.204997 1.065125
H  4.355348 1.876168 -3.490839
H  5.154682 -2.296075 -3.873938
H  5.789172 0.063209 -4.298144
H  -2.665144 -2.791226 1.253247
H  -4.421914 2.208534 3.063039
H  2.791363 4.723359 -1.384039
H  1.294244 4.278974 -2.234988
H  1.545246 3.76792 -0.555239
H  -0.406767 3.650812 1.630735
H  0.01329 2.000261 2.119146
H  -0.692656 2.298284 0.517284
H  -7.333357 -1.155112 3.597689
H  -6.454223 -1.706323 2.154195
H  -5.793877 -2.028147 3.765298
totalener: -1764.50615886 hartree
nucrepener: 2937.42004385 hartree
electener: -4701.92620272 hartree
oneelecener: -8257.98966443 hartree
twoeener: 3556.06346171 hartree
kineticenergy: 1758.19285280 hartree
xcener: -145.281747829535 hartree
chargesum: -0.0000000
charge: 0.850516 -0.419271 -0.486549 -0.260936 -0.398364 -0.375828 -0.263433 -0.263482 -0.230413 -0.171649 -0.427277 -0.406381 -0.233319 -0.071003 0.016490 -0.069832 -0.146623 -0.113878 -0.123304 0.457634 0.339753 0.360568 0.399397 0.386773 -0.303644 -0.125767 -0.126704 -0.125216 0.162398 0.155726 0.116193 0.197561 0.125565 0.132461 0.129368 0.167580 0.128984 0.119612 0.111882 0.098545 0.123131 0.114921 0.106800 0.124049 0.107777 0.109190
qa: 0.8505 -0.4193 -0.4865 -0.2609 -0.3984 -0.3758 -0.2634 -0.2635 -0.2304 -0.1716 -0.4273 -0.4064 -0.2333 -0.0710 0.0165 -0.0698 -0.1466 -0.1139 -0.1233 0.4576 0.3398 0.3606 0.3994 0.3868 -0.3036 -0.1258 -0.1267 -0.1252 0.1624 0.1557 0.1162 0.1976 0.1256 0.1325 0.1294 0.1676 0.1290 0.1196 0.1119 0.0985 0.1231 0.1149 0.1068 0.1240 0.1078 0.1092
va: 5.7533 2.0746 1.9984 2.1218 2.0927 2.1358 2.1629 2.1502 3.0579 3.1650 2.9747 2.9728 3.8326 3.8564 3.7600 3.9690 4.0168 3.9716 3.9720 4.0774 4.4157 4.2500 4.0208 4.0578 3.9400 3.9081 3.8666 3.8757 1.0296 1.0146 1.0117 1.0784 1.0263 0.9988 1.0006 1.0359 1.0220 0.9963 0.9949 0.9924 0.9956 0.9942 1.0027 0.9939 0.9971 0.9968
dispcorr: -0.024886540 hartree
energy: -1764.531045405165
dipole: -2.58396 1.54918 -1.03478 9.14004 -7.96042 1.17963 -3.13151 2.71356 -0.41794
magnitude: 1.62387 au
magnitude: 4.12755 debye
