program: Orca
programVersion: 4.2.1
elementType: S O O O O O O O N N N N C C C C C C C C C C C C C C C C H H H H H H H H H H H H H H H H H H
charge: 0
multiplicity: 1
keywords: wb97x-d3
keywords: def2-TZVPP
keywords: def2/J RIJCOSX GRIDX6 NOFINALGRIDX
keywords: grid4 nofinalgrid
keywords: scfconv7
keywords: smallprint printgap noloewdin
keywords: NOSOSCF
formula: C16H18N4O7S
InChI: InChI=1S/C16H18N4O7S/c1-25-12-8-13(26-2)18-15(17-12)19-16(22)20-28(23,24)9-10-6-4-5-7-11(10)14(21)27-3/h4-8,19-20H,9H2,1-3H3
46 atoms
S  0.563339 -0.2126 -1.464706
O  0.896257 1.153797 -1.106977
O  0.179127 -0.549088 -2.812665
O  4.069093 2.186997 -0.107367
O  3.170265 0.462106 0.977189
O  -1.041985 -2.75208 -1.012699
O  -5.995357 -0.446705 3.007998
O  -2.502116 2.489083 2.140915
N  -0.666507 -0.591607 -0.389193
N  -2.525612 -1.760734 0.368559
N  -4.258839 -1.108091 1.686743
N  -2.490007 0.390005 1.248539
C  1.898124 -1.306834 -0.954895
C  3.144329 -0.89979 -1.680679
C  3.952026 0.16898 -1.269431
C  3.458752 -1.567119 -2.858342
C  5.063672 0.517533 -2.031903
C  4.574704 -1.223481 -3.602487
C  5.383165 -0.180337 -3.1841
C  3.667444 0.92461 -0.015495
C  -1.372014 -1.763612 -0.408006
C  -3.107256 -0.774755 1.12984
C  -4.840008 -0.1767 2.427682
C  -3.084422 1.313941 1.995517
C  -4.294244 1.086567 2.630161
C  3.843024 3.012105 1.025288
C  -6.574136 -1.725812 2.802818
C  -1.261425 2.724813 1.488099
H  1.582588 -2.313083 -1.228563
H  1.986979 -1.23414 0.125214
H  2.814128 -2.368101 -3.196466
H  -1.028961 0.173041 0.189681
H  5.691788 1.340475 -1.721923
H  4.805143 -1.764464 -4.510401
H  6.25716 0.098874 -3.756992
H  -3.035087 -2.631244 0.344979
H  -4.779379 1.835723 3.236459
H  2.779544 3.085163 1.254131
H  4.367592 2.643276 1.907305
H  4.224252 3.994359 0.759482
H  -5.933867 -2.524915 3.17728
H  -7.5071 -1.717484 3.36002
H  -6.781653 -1.911659 1.748703
H  -0.979737 3.739546 1.755364
H  -0.484665 2.03686 1.825541
H  -1.347922 2.653712 0.403213
totalener: -1764.50714339 hartree
nucrepener: 2911.87622146 hartree
electener: -4676.38336485 hartree
oneelecener: -8207.01611174 hartree
twoeener: 3530.63274689 hartree
kineticenergy: 1758.19393630 hartree
xcener: -145.281011784709 hartree
chargesum: 0.0000000
charge: 0.857532 -0.489571 -0.422454 -0.262340 -0.385300 -0.384149 -0.263119 -0.262157 -0.242559 -0.169952 -0.405983 -0.428779 -0.225353 -0.072660 0.018153 -0.068185 -0.147426 -0.114946 -0.123785 0.443502 0.354084 0.362461 0.385986 0.397797 -0.301644 -0.129148 -0.126002 -0.128353 0.156096 0.163092 0.116102 0.194485 0.124347 0.131335 0.128247 0.168054 0.129234 0.106762 0.111120 0.117084 0.108219 0.124446 0.109272 0.125780 0.107934 0.112739
qa: 0.8575 -0.4896 -0.4225 -0.2623 -0.3853 -0.3841 -0.2631 -0.2622 -0.2426 -0.1700 -0.4060 -0.4288 -0.2254 -0.0727 0.0182 -0.0682 -0.1474 -0.1149 -0.1238 0.4435 0.3541 0.3625 0.3860 0.3978 -0.3016 -0.1291 -0.1260 -0.1284 0.1561 0.1631 0.1161 0.1945 0.1243 0.1313 0.1282 0.1681 0.1292 0.1068 0.1111 0.1171 0.1082 0.1244 0.1093 0.1258 0.1079 0.1127
va: 5.7398 1.9945 2.0725 2.1200 2.1066 2.1280 2.1506 2.1611 3.0614 3.1667 2.9732 2.9739 3.8360 3.8503 3.7637 3.9708 4.0226 3.9705 3.9718 4.1007 4.4041 4.2472 4.0590 4.0223 3.9374 3.9040 3.8754 3.8674 1.0161 1.0327 1.0120 1.0785 1.0260 0.9988 1.0006 1.0357 1.0217 0.9931 0.9948 0.9951 0.9969 0.9938 0.9966 0.9957 0.9963 0.9991
dispcorr: -0.023999749 hartree
energy: -1764.531143138259
dipole: 2.89997 -3.07460 -0.17463 4.94380 -4.54876 0.39504 5.94027 -4.71164 1.22863
magnitude: 1.30233 au
magnitude: 3.31027 debye
