program: Orca
programVersion: 4.2.1
elementType: S O O O O O O O N N N N C C C C C C C C C C C C C C C C H H H H H H H H H H H H H H H H H H
charge: 0
multiplicity: 1
keywords: wb97x-d3
keywords: def2-TZVPP
keywords: def2/J RIJCOSX GRIDX6 NOFINALGRIDX
keywords: grid4 nofinalgrid
keywords: scfconv7
keywords: smallprint printgap noloewdin
keywords: NOSOSCF
formula: C16H18N4O7S
InChI: InChI=1S/C16H18N4O7S/c1-25-12-8-13(26-2)18-15(17-12)19-16(22)20-28(23,24)9-10-6-4-5-7-11(10)14(21)27-3/h4-8,19-20H,9H2,1-3H3
46 atoms
S  1.752333 -2.431359 0.788356
O  2.029838 -3.763132 0.320788
O  1.737644 -2.112436 2.201843
O  0.213928 1.694183 -1.673694
O  1.603519 0.072002 -2.298033
O  0.163714 -2.87691 -1.815317
O  -1.634356 1.412322 2.403741
O  -4.487657 1.991546 -1.215479
N  0.256682 -1.907183 0.259849
N  -1.424269 -1.377906 -1.249435
N  -1.536633 -0.007412 0.622022
N  -2.967282 0.292228 -1.229322
C  2.881878 -1.290187 -0.044872
C  2.695108 0.109862 0.458967
C  1.876401 1.079548 -0.142994
C  3.32901 0.431557 1.656885
C  1.719353 2.322978 0.472884
C  3.183554 1.673179 2.248403
C  2.368321 2.623589 1.656147
C  1.236596 0.865115 -1.472628
C  -0.272668 -2.125687 -0.988967
C  -1.993198 -0.323188 -0.578825
C  -2.076127 1.050815 1.215479
C  -3.508525 1.334223 -0.617024
C  -3.094385 1.786559 0.630313
C  -0.3688 1.692285 -2.971507
C  -0.598043 0.64954 3.011473
C  -4.932237 1.536416 -2.48272
H  2.73782 -1.417497 -1.114417
H  3.87571 -1.66406 0.211089
H  3.950268 -0.312803 2.136586
H  -0.220819 -1.218264 0.852226
H  1.089825 3.071478 0.01491
H  3.699865 1.892534 3.173341
H  2.239791 3.597422 2.108819
H  -1.827818 -1.570417 -2.153752
H  -3.539882 2.642808 1.112504
H  0.359303 1.974177 -3.732479
H  -0.783673 0.718893 -3.227861
H  -1.166968 2.428225 -2.938416
H  -0.896533 -0.3870 3.172202
H  0.320846 0.669229 2.425346
H  -0.414457 1.120609 3.97297
H  -5.73324 2.211286 -2.772397
H  -4.138192 1.573892 -3.229571
H  -5.314794 0.516496 -2.436641
totalener: -1764.50175702 hartree
nucrepener: 3176.57086085 hartree
electener: -4941.07261786 hartree
oneelecener: -8735.44550232 hartree
twoeener: 3794.37288445 hartree
kineticenergy: 1758.19274061 hartree
xcener: -145.283889915435 hartree
chargesum: 0.0000000
charge: 0.832847 -0.413207 -0.473051 -0.266267 -0.344838 -0.323648 -0.262009 -0.262411 -0.211661 -0.167244 -0.397939 -0.393154 -0.250386 -0.059672 0.025198 -0.040669 -0.178327 -0.128454 -0.122571 0.395854 0.287898 0.308988 0.396442 0.375200 -0.298663 -0.142248 -0.084690 -0.121913 0.182825 0.133648 0.114358 0.196308 0.127264 0.135075 0.131856 0.170920 0.127422 0.133008 0.113030 0.115657 0.129109 0.049254 0.126212 0.125664 0.098985 0.110001
qa: 0.8328 -0.4132 -0.4731 -0.2663 -0.3448 -0.3236 -0.2620 -0.2624 -0.2117 -0.1672 -0.3979 -0.3932 -0.2504 -0.0597 0.0252 -0.0407 -0.1783 -0.1285 -0.1226 0.3959 0.2879 0.3090 0.3964 0.3752 -0.2987 -0.1422 -0.0847 -0.1219 0.1828 0.1336 0.1144 0.1963 0.1273 0.1351 0.1319 0.1709 0.1274 0.1330 0.1130 0.1157 0.1291 0.0493 0.1262 0.1257 0.0990 0.1100
va: 5.8018 2.0956 2.0056 2.0854 2.1420 2.1885 2.1565 2.1430 3.0406 3.1476 2.9448 2.9368 3.8397 3.7503 3.5372 3.9151 3.9528 3.9707 3.9202 4.0875 4.4447 4.2697 4.0066 4.0518 3.9514 3.8775 3.8666 3.8831 1.0279 1.0173 1.0158 1.0853 1.0323 0.9983 1.0011 1.0336 1.0221 1.0014 0.9968 0.9881 0.9996 0.9953 0.9986 0.9939 0.9941 0.9973
dispcorr: -0.033315807 hartree
energy: -1764.535072825159
dipole: -5.25984 4.21731 -1.04253 14.87515 -11.94127 2.93388 -2.00190 2.02189 0.01999
magnitude: 3.11367 au
magnitude: 7.91432 debye
