program: Orca
programVersion: 4.2.1
elementType: S O O O O O O O N N N N C C C C C C C C C C C C C C C C H H H H H H H H H H H H H H H H H H
charge: 0
multiplicity: 1
keywords: wb97x-d3
keywords: def2-TZVPP
keywords: def2/J RIJCOSX GRIDX6 NOFINALGRIDX
keywords: grid4 nofinalgrid
keywords: scfconv7
keywords: smallprint printgap noloewdin
keywords: NOSOSCF
formula: C16H18N4O7S
InChI: InChI=1S/C16H18N4O7S/c1-25-12-8-13(26-2)18-15(17-12)19-16(22)20-28(23,24)9-10-6-4-5-7-11(10)14(21)27-3/h4-8,19-20H,9H2,1-3H3
46 atoms
S  1.585765 -2.083969 -0.655176
O  1.064212 -1.690056 -1.951417
O  1.997891 -3.437253 -0.391485
O  1.723987 0.889627 -3.688623
O  3.580577 -0.112765 -2.957199
O  1.285069 -2.21856 2.375152
O  -2.867889 0.991818 -1.03862
O  -4.675936 0.904474 3.240496
N  0.35053 -1.625131 0.378559
N  -0.747885 -1.237056 2.383104
N  -1.816623 -0.146211 0.633746
N  -2.71073 -0.171799 2.816207
C  2.929623 -0.97168 -0.198287
C  2.473703 0.45314 -0.237301
C  2.248555 1.148825 -1.431222
C  2.170878 1.078684 0.967673
C  1.729603 2.439565 -1.388584
C  1.670664 2.369899 1.004503
C  1.447579 3.053105 -0.179115
C  2.602157 0.552319 -2.751853
C  0.380157 -1.737314 1.740258
C  -1.801692 -0.489934 1.910858
C  -2.831919 0.604354 0.220948
C  -3.728535 0.559633 2.386623
C  -3.852584 0.996738 1.072111
C  1.94511 0.34927 -4.985899
C  -1.782598 0.645683 -1.892953
C  -4.571563 0.46066 4.583926
H  3.734035 -1.192826 -0.898944
H  3.24272 -1.272597 0.801306
H  2.332007 0.540603 1.893784
H  -0.40881 -1.068262 -0.027732
H  1.552148 2.976991 -2.30995
H  1.453443 2.836939 1.955755
H  1.055836 4.061251 -0.164607
H  -0.759167 -1.402614 3.378168
H  -4.68263 1.600948 0.740171
H  2.888596 0.692751 -5.410433
H  1.943235 -0.739896 -4.961313
H  1.121098 0.701599 -5.600207
H  -0.833979 1.03878 -1.525361
H  -1.692148 -0.433046 -2.025205
H  -2.009576 1.101658 -2.852414
H  -4.570727 -0.627537 4.651739
H  -3.670636 0.839351 5.067309
H  -5.44807 0.854617 5.09132
totalener: -1764.50701312 hartree
nucrepener: 3061.75034708 hartree
electener: -4826.25736020 hartree
oneelecener: -8506.00594978 hartree
twoeener: 3679.74858958 hartree
kineticenergy: 1758.19496292 hartree
xcener: -145.282669409726 hartree
chargesum: -0.0000000
charge: 0.848800 -0.486686 -0.420536 -0.269165 -0.361508 -0.364379 -0.263392 -0.263251 -0.195720 -0.160564 -0.415353 -0.405196 -0.252015 -0.036555 0.004882 -0.090024 -0.193459 -0.142100 -0.090484 0.444414 0.284071 0.356984 0.393852 0.383864 -0.299282 -0.131813 -0.099495 -0.124671 0.167504 0.156904 0.133243 0.193767 0.125632 0.134047 0.132365 0.167811 0.129201 0.113208 0.124031 0.111520 0.077111 0.119146 0.123019 0.109885 0.106404 0.123981
qa: 0.8488 -0.4867 -0.4205 -0.2692 -0.3615 -0.3644 -0.2634 -0.2633 -0.1957 -0.1606 -0.4154 -0.4052 -0.2520 -0.0366 0.0049 -0.0900 -0.1935 -0.1421 -0.0905 0.4444 0.2841 0.3570 0.3939 0.3839 -0.2993 -0.1318 -0.0995 -0.1247 0.1675 0.1569 0.1332 0.1938 0.1256 0.1340 0.1324 0.1678 0.1292 0.1132 0.1240 0.1115 0.0771 0.1191 0.1230 0.1099 0.1064 0.1240
va: 5.7627 1.9851 2.0891 2.0988 2.1351 2.1401 2.1660 2.1503 3.0707 3.1533 2.9695 2.9776 3.8389 3.6916 3.6824 3.8876 3.9840 4.0005 3.9254 4.0990 4.4465 4.2427 4.0209 4.0600 3.9336 3.8834 3.8743 3.8760 1.0320 1.0166 1.0132 1.0852 1.0276 0.9990 0.9982 1.0356 1.0219 0.9958 0.9963 0.9942 0.9953 0.9986 0.9995 0.9966 0.9973 0.9939
dispcorr: -0.028761484 hartree
energy: -1764.535774605394
dipole: -5.45884 3.85060 -1.60825 11.37390 -9.05605 2.31785 -2.20007 2.73659 0.53652
magnitude: 2.87171 au
magnitude: 7.29931 debye
