program: Orca
programVersion: 4.2.1
elementType: S O O O O O O O N N N N C C C C C C C C C C C C C C C C H H H H H H H H H H H H H H H H H H
charge: 0
multiplicity: 1
keywords: wb97x-d3
keywords: def2-TZVPP
keywords: def2/J RIJCOSX GRIDX6 NOFINALGRIDX
keywords: grid4 nofinalgrid
keywords: scfconv7
keywords: smallprint printgap noloewdin
keywords: NOSOSCF
formula: C16H18N4O7S
InChI: InChI=1S/C16H18N4O7S/c1-25-12-8-13(26-2)18-15(17-12)19-16(22)20-28(23,24)9-10-6-4-5-7-11(10)14(21)27-3/h4-8,19-20H,9H2,1-3H3
46 atoms
S  2.105972 -1.481549 0.771421
O  2.592292 -2.691893 1.379303
O  2.463318 -0.174875 1.293472
O  3.343696 2.439698 -0.259956
O  4.485056 0.648883 -0.952111
O  -0.027315 -3.477126 -0.098046
O  -5.682237 0.130244 0.912673
O  -1.648322 2.383004 1.399976
N  0.432844 -1.430103 0.802754
N  -1.749052 -2.112933 0.422634
N  -3.715657 -0.997632 0.669749
N  -1.672698 0.147866 0.948868
C  2.47745 -1.53228 -0.992909
C  1.792223 -0.412239 -1.710686
C  2.209424 0.920695 -1.617449
C  0.633523 -0.701192 -2.424115
C  1.463148 1.920679 -2.234077
C  -0.096248 0.296275 -3.049504
C  0.319614 1.613571 -2.952961
C  3.469619 1.288193 -0.908844
C  -0.393724 -2.417462 0.345063
C  -2.396081 -0.931111 0.698946
C  -4.361116 0.132964 0.916152
C  -2.332151 1.279012 1.174147
C  -3.716731 1.337558 1.176031
C  4.476312 2.872288 0.484584
C  -6.355517 -1.093624 0.663228
C  -0.226873 2.336497 1.333313
H  2.14066 -2.507269 -1.344416
H  3.564292 -1.494256 -1.057036
H  0.300126 -1.729709 -2.489301
H  0.002315 -0.523284 1.015008
H  1.782947 2.950978 -2.160235
H  -0.988323 0.042892 -3.606367
H  -0.241759 2.402458 -3.435073
H  -2.35612 -2.877222 0.167708
H  -4.256295 2.252728 1.364697
H  4.742495 2.14283 1.248989
H  5.339999 3.04415 -0.158002
H  4.183542 3.805845 0.957332
H  -6.109981 -1.849597 1.409487
H  -7.415615 -0.861102 0.717745
H  -6.120545 -1.491352 -0.324332
H  0.1069 3.354738 1.511701
H  0.198643 1.684566 2.097007
H  0.125109 2.011386 0.353621
totalener: -1764.50703258 hartree
nucrepener: 3064.40960655 hartree
electener: -4828.91663913 hartree
oneelecener: -8511.31856702 hartree
twoeener: 3682.40192789 hartree
kineticenergy: 1758.19663376 hartree
xcener: -145.282999411167 hartree
chargesum: -0.0000000
charge: 0.847684 -0.420520 -0.486501 -0.268945 -0.360839 -0.364093 -0.263134 -0.263532 -0.193292 -0.159026 -0.404745 -0.414376 -0.251129 -0.036711 0.006331 -0.088139 -0.194234 -0.142173 -0.089388 0.442040 0.281621 0.355313 0.383638 0.392214 -0.297774 -0.132048 -0.125370 -0.098175 0.156452 0.166110 0.133331 0.193544 0.125003 0.133607 0.132193 0.167549 0.129075 0.123959 0.113708 0.111646 0.109830 0.124436 0.106975 0.122689 0.119494 0.075703
qa: 0.8477 -0.4205 -0.4865 -0.2689 -0.3608 -0.3641 -0.2631 -0.2635 -0.1933 -0.1590 -0.4047 -0.4144 -0.2511 -0.0367 0.0063 -0.0881 -0.1942 -0.1422 -0.0894 0.4420 0.2816 0.3553 0.3836 0.3922 -0.2978 -0.1320 -0.1254 -0.0982 0.1565 0.1661 0.1333 0.1935 0.1250 0.1336 0.1322 0.1675 0.1291 0.1240 0.1137 0.1116 0.1098 0.1244 0.1070 0.1227 0.1195 0.0757
va: 5.7643 2.0888 1.9855 2.0981 2.1358 2.1403 2.1502 2.1662 3.0703 3.1523 2.9765 2.9700 3.8394 3.6877 3.6789 3.8847 3.9814 4.0008 3.9272 4.1009 4.4479 4.2436 4.0598 4.0232 3.9325 3.8826 3.8753 3.8749 1.0168 1.0319 1.0128 1.0857 1.0275 0.9992 0.9979 1.0357 1.0219 0.9965 0.9958 0.9941 0.9968 0.9939 0.9971 0.9995 0.9985 0.9953
dispcorr: -0.028862321 hartree
energy: -1764.535894898221
dipole: -5.55708 3.43535 -2.12173 10.86269 -9.12959 1.73310 -3.88011 3.01250 -0.86761
magnitude: 2.87370 au
magnitude: 7.30436 debye
