program: Orca
programVersion: 4.2.1
elementType: S O O O O O O O N N N N C C C C C C C C C C C C C C C C H H H H H H H H H H H H H H H H H H
charge: 0
multiplicity: 1
keywords: wb97x-d3
keywords: def2-TZVPP
keywords: def2/J RIJCOSX GRIDX6 NOFINALGRIDX
keywords: grid4 nofinalgrid
keywords: scfconv7
keywords: smallprint printgap noloewdin
keywords: NOSOSCF
formula: C16H18N4O7S
InChI: InChI=1S/C16H18N4O7S/c1-25-12-8-13(26-2)18-15(17-12)19-16(22)20-28(23,24)9-10-6-4-5-7-11(10)14(21)27-3/h4-8,19-20H,9H2,1-3H3
46 atoms
S  1.931787 -1.316089 0.741469
O  2.315264 -2.486783 1.487722
O  2.268327 0.017422 1.206498
O  3.673907 2.430332 -0.474132
O  4.649526 0.451998 -0.8075
O  -0.144222 -3.297472 -0.273843
O  -5.914934 -0.072189 1.239508
O  -1.989228 2.347909 1.792837
N  0.26363 -1.22929 0.595022
N  -1.902958 -2.004812 0.29385
N  -3.907024 -1.042394 0.764477
N  -1.916489 0.190051 1.056851
C  2.483877 -1.519797 -0.959803
C  1.984025 -0.407901 -1.826197
C  2.515835 0.88685 -1.786973
C  0.889989 -0.658301 -2.647115
C  1.942624 1.889035 -2.563968
C  0.337676 0.33852 -3.434721
C  0.865431 1.617961 -3.391646
C  3.723461 1.200121 -0.969247
C  -0.540026 -2.251952 0.180018
C  -2.593516 -0.898465 0.729536
C  -4.598152 0.010301 1.175169
C  -2.623227 1.239658 1.462319
C  -4.005696 1.211817 1.548483
C  4.762627 2.822972 0.352108
C  -6.535401 -1.295154 0.875489
C  -0.571413 2.386883 1.684274
H  2.107128 -2.489976 -1.28213
H  3.570125 -1.569951 -0.898134
H  0.467761 -1.655504 -2.668697
H  -0.187047 -0.354714 0.881604
H  2.349256 2.890287 -2.53366
H  -0.504894 0.115072 -4.075427
H  0.442243 2.405744 -4.000261
H  -2.483055 -2.783378 0.019875
H  -4.581566 2.061554 1.881047
H  4.554359 3.846044 0.653342
H  4.830395 2.188159 1.235451
H  5.711723 2.7864 -0.183074
H  -6.206312 -2.120088 1.507823
H  -7.601312 -1.135137 1.013687
H  -6.338616 -1.555137 -0.164935
H  -0.282832 3.387417 1.993651
H  -0.089141 1.659739 2.338634
H  -0.235376 2.218171 0.660121
totalener: -1764.50818275 hartree
nucrepener: 3007.98620437 hartree
electener: -4772.49438713 hartree
oneelecener: -8398.72700906 hartree
twoeener: 3626.23262194 hartree
kineticenergy: 1758.19368118 hartree
xcener: -145.281803327769 hartree
chargesum: 0.0000000
charge: 0.850184 -0.424284 -0.490721 -0.268346 -0.367651 -0.378137 -0.263093 -0.262688 -0.204303 -0.163441 -0.407283 -0.425422 -0.261425 -0.039490 0.016292 -0.094879 -0.172229 -0.130873 -0.115843 0.448008 0.311173 0.363450 0.384993 0.396318 -0.300301 -0.131850 -0.125177 -0.117775 0.160656 0.170191 0.132172 0.197171 0.125596 0.132914 0.130866 0.167957 0.129755 0.112833 0.122451 0.111670 0.109738 0.124200 0.107091 0.125502 0.111598 0.102434
qa: 0.8502 -0.4243 -0.4907 -0.2683 -0.3677 -0.3781 -0.2631 -0.2627 -0.2043 -0.1634 -0.4073 -0.4254 -0.2614 -0.0395 0.0163 -0.0949 -0.1722 -0.1309 -0.1158 0.4480 0.3112 0.3634 0.3850 0.3963 -0.3003 -0.1319 -0.1252 -0.1178 0.1607 0.1702 0.1322 0.1972 0.1256 0.1329 0.1309 0.1680 0.1298 0.1128 0.1225 0.1117 0.1097 0.1242 0.1071 0.1255 0.1116 0.1024
va: 5.7496 2.0855 1.9802 2.1106 2.1266 2.1283 2.1508 2.1619 3.0647 3.1579 2.9736 2.9723 3.8460 3.6967 3.7369 3.8962 4.0250 3.9978 3.9626 4.0995 4.4247 4.2420 4.0573 4.0245 3.9356 3.8858 3.8756 3.8707 1.0155 1.0318 1.0124 1.0752 1.0256 0.9990 0.9993 1.0359 1.0217 0.9941 0.9955 0.9960 0.9967 0.9940 0.9970 0.9962 0.9991 0.9930
dispcorr: -0.026278334 hartree
energy: -1764.534461085711
dipole: -4.51759 2.52065 -1.99694 10.12782 -8.47084 1.65698 -3.74944 2.87187 -0.87757
magnitude: 2.73925 au
magnitude: 6.96261 debye
