program: Orca
programVersion: 4.2.1
elementType: S O O O O O O O N N N N C C C C C C C C C C C C C C C C H H H H H H H H H H H H H H H H H H
charge: 0
multiplicity: 1
keywords: wb97x-d3
keywords: def2-TZVPP
keywords: def2/J RIJCOSX GRIDX6 NOFINALGRIDX
keywords: grid4 nofinalgrid
keywords: scfconv7
keywords: smallprint printgap noloewdin
keywords: NOSOSCF
formula: C16H18N4O7S
InChI: InChI=1S/C16H18N4O7S/c1-25-12-8-13(26-2)18-15(17-12)19-16(22)20-28(23,24)9-10-6-4-5-7-11(10)14(21)27-3/h4-8,19-20H,9H2,1-3H3
46 atoms
S  0.465678 -2.687775 -1.150999
O  -0.795139 -3.109817 -1.72549
O  1.389256 -3.63072 -0.574961
O  0.593033 2.161168 -0.776805
O  0.034715 0.888067 -2.513417
O  1.893416 -1.448524 1.324884
O  -3.875595 0.442173 -0.346742
O  -2.79285 2.981015 3.389473
N  0.028508 -1.539247 -0.014232
N  0.141533 -0.12703 1.82475
N  -1.880679 0.136388 0.714633
N  -1.317334 1.430667 2.604981
C  1.331949 -1.711368 -2.403429
C  2.368201 -0.825421 -1.788718
C  2.115416 0.49419 -1.380169
C  3.613477 -1.381731 -1.525069
C  3.12138 1.210665 -0.73335
C  4.608105 -0.657148 -0.893833
C  4.361143 0.645233 -0.497118
C  0.811372 1.168347 -1.636213
C  0.78309 -1.092281 1.045086
C  -1.070803 0.498971 1.697844
C  -3.048857 0.762956 0.629129
C  -2.488033 2.041219 2.511716
C  -3.424486 1.751884 1.524184
C  -0.550865 2.974528 -1.002025
C  -3.461628 -0.526731 -1.305139
C  -1.855125 3.282255 4.41074
H  0.574876 -1.175523 -2.966133
H  1.788799 -2.459314 -3.054658
H  3.799009 -2.409726 -1.806605
H  -0.912981 -1.143033 -0.110881
H  2.937937 2.226498 -0.415158
H  5.568731 -1.115218 -0.701245
H  5.128946 1.221304 0.001166
H  0.708078 0.206362 2.58985
H  -4.374361 2.259753 1.460511
H  -0.445009 3.557919 -1.917033
H  -1.464193 2.387576 -1.069042
H  -0.613205 3.644292 -0.149435
H  -3.280489 -1.50157 -0.851207
H  -4.284945 -0.610133 -2.008785
H  -2.564767 -0.208075 -1.838403
H  -0.908067 3.634491 4.001022
H  -2.310552 4.071562 5.002755
H  -1.657831 2.418678 5.046323
totalener: -1764.50203654 hartree
nucrepener: 3136.03112118 hartree
electener: -4900.53315772 hartree
oneelecener: -8654.82981577 hartree
twoeener: 3754.29665805 hartree
kineticenergy: 1758.20039683 hartree
xcener: -145.285204202226 hartree
chargesum: 0.0000000
charge: 0.828184 -0.468859 -0.418458 -0.269320 -0.384477 -0.327319 -0.260258 -0.263002 -0.212382 -0.133938 -0.403636 -0.400335 -0.251778 -0.084528 0.034806 -0.035374 -0.137881 -0.111172 -0.110882 0.429367 0.260746 0.343821 0.344054 0.377039 -0.285075 -0.155969 -0.120188 -0.126457 0.170785 0.131322 0.110991 0.195795 0.122327 0.130158 0.127231 0.165794 0.129105 0.134642 0.115685 0.123606 0.115034 0.126291 0.103250 0.106253 0.125031 0.109967
qa: 0.8282 -0.4689 -0.4185 -0.2693 -0.3845 -0.3273 -0.2603 -0.2630 -0.2124 -0.1339 -0.4036 -0.4003 -0.2518 -0.0845 0.0348 -0.0354 -0.1379 -0.1112 -0.1109 0.4294 0.2607 0.3438 0.3441 0.3770 -0.2851 -0.1560 -0.1202 -0.1265 0.1708 0.1313 0.1110 0.1958 0.1223 0.1302 0.1272 0.1658 0.1291 0.1346 0.1157 0.1236 0.1150 0.1263 0.1032 0.1063 0.1250 0.1100
va: 5.7880 2.0191 2.0752 2.0874 2.1024 2.1786 2.1489 2.1506 3.0223 3.1578 2.9237 2.9570 3.8651 3.7939 3.5484 3.9770 4.0182 4.0154 3.9842 4.0622 4.4647 4.2321 4.0354 4.0487 3.9226 3.8932 3.8588 3.8769 1.0336 1.0148 1.0152 1.0829 1.0284 0.9986 1.0004 1.0385 1.0223 0.9979 0.9818 0.9901 0.9956 0.9975 0.9971 0.9967 0.9936 0.9970
dispcorr: -0.031467291 hartree
energy: -1764.533503830269
dipole: -2.24961 2.15231 -0.09730 13.97178 -11.46045 2.51133 1.16330 -0.63792 0.52538
magnitude: 2.56754 au
magnitude: 6.52616 debye
