program: Orca
programVersion: 4.2.1
elementType: S O O O O O O O N N N N C C C C C C C C C C C C C C C C H H H H H H H H H H H H H H H H H H
charge: 0
multiplicity: 1
keywords: wb97x-d3
keywords: def2-TZVPP
keywords: def2/J RIJCOSX GRIDX6 NOFINALGRIDX
keywords: grid4 nofinalgrid
keywords: scfconv7
keywords: smallprint printgap noloewdin
keywords: NOSOSCF
formula: C16H18N4O7S
InChI: InChI=1S/C16H18N4O7S/c1-25-12-8-13(26-2)18-15(17-12)19-16(22)20-28(23,24)9-10-6-4-5-7-11(10)14(21)27-3/h4-8,19-20H,9H2,1-3H3
46 atoms
S  1.233831 -2.678306 -0.503161
O  0.151169 -3.193721 -1.316359
O  2.111673 -3.55836 0.222633
O  3.071222 1.097982 -0.539067
O  1.176628 2.02649 0.190448
O  2.217426 -1.04059 1.875429
O  -3.450958 0.013774 -0.542861
O  -3.10594 2.934942 3.053244
N  0.463109 -1.614541 0.529639
N  0.206161 -0.085216 2.251902
N  -1.643337 -0.0754 0.845646
N  -1.452163 1.414816 2.662803
C  2.249348 -1.583938 -1.524206
C  1.394664 -0.593029 -2.251523
C  1.117003 0.694807 -1.775866
C  0.746416 -1.025642 -3.406485
C  0.182539 1.490466 -2.435817
C  -0.145809 -0.212992 -4.083008
C  -0.440027 1.048266 -3.588797
C  1.767173 1.32925 -0.591476
C  1.057462 -0.935759 1.561483
C  -1.016569 0.434675 1.892791
C  -2.805051 0.47467 0.511767
C  -2.61735 1.945153 2.326565
C  -3.363162 1.51649 1.233531
C  3.7906 1.664665 0.553987
C  -2.852628 -1.024276 -1.308657
C  -2.342136 3.405945 4.151919
H  2.756744 -2.258914 -2.217023
H  3.00056 -1.152962 -0.868469
H  0.939679 -2.023995 -3.775532
H  -0.50308 -1.351433 0.297857
H  -0.045349 2.471437 -2.041472
H  -0.623002 -0.572275 -4.984936
H  -1.149636 1.686041 -4.098223
H  0.658436 0.41327 3.003413
H  -4.307551 1.964666 0.966219
H  3.441527 1.266404 1.504433
H  4.827013 1.378848 0.402958
H  3.707671 2.750798 0.56018
H  -2.721841 -1.938329 -0.727885
H  -3.542185 -1.219682 -2.125317
H  -1.888844 -0.722423 -1.72107
H  -1.369424 3.783513 3.835336
H  -2.922439 4.215866 4.586081
H  -2.186195 2.628546 4.900352
totalener: -1764.50463277 hartree
nucrepener: 3143.02159804 hartree
electener: -4907.52623081 hartree
oneelecener: -8668.80297247 hartree
twoeener: 3761.27674166 hartree
kineticenergy: 1758.19628350 hartree
xcener: -145.283133735900 hartree
chargesum: 0.0000000
charge: 0.836608 -0.473161 -0.418470 -0.263793 -0.365765 -0.365399 -0.265217 -0.265278 -0.196960 -0.151169 -0.409188 -0.398320 -0.244878 -0.057837 0.066113 -0.062091 -0.150269 -0.132706 -0.130646 0.373403 0.264496 0.367925 0.393926 0.387796 -0.301192 -0.123342 -0.081459 -0.129204 0.133831 0.165855 0.117179 0.198914 0.130627 0.133728 0.132015 0.166324 0.127688 0.116843 0.119912 0.115161 0.124080 0.124513 0.046854 0.111719 0.122784 0.108050
qa: 0.8366 -0.4732 -0.4185 -0.2638 -0.3658 -0.3654 -0.2652 -0.2653 -0.1970 -0.1512 -0.4092 -0.3983 -0.2449 -0.0578 0.0661 -0.0621 -0.1503 -0.1327 -0.1306 0.3734 0.2645 0.3679 0.3939 0.3878 -0.3012 -0.1233 -0.0815 -0.1292 0.1338 0.1659 0.1172 0.1989 0.1306 0.1337 0.1320 0.1663 0.1277 0.1168 0.1199 0.1152 0.1241 0.1245 0.0469 0.1117 0.1228 0.1081
va: 5.7918 2.0058 2.0904 2.1365 2.1128 2.1355 2.1585 2.1493 3.0600 3.1801 2.9604 2.9650 3.8737 3.7356 3.6025 3.9278 3.9365 3.9611 3.9121 4.1014 4.4784 4.2325 4.0149 4.0625 3.9386 3.8657 3.8737 3.8779 1.0185 1.0306 1.0163 1.0832 1.0229 0.9993 1.0007 1.0377 1.0222 1.0043 0.9953 0.9951 0.9998 0.9989 0.9978 0.9963 0.9938 0.9967
dispcorr: -0.031569380 hartree
energy: -1764.536202147885
dipole: -1.78431 1.26779 -0.51652 10.80932 -8.92276 1.88655 -2.73733 2.06147 -0.67586
magnitude: 2.06946 au
magnitude: 5.26015 debye
