program: Orca
programVersion: 4.2.1
elementType: S O O O O O O O N N N N C C C C C C C C C C C C C C C C H H H H H H H H H H H H H H H H H H
charge: 0
multiplicity: 1
keywords: wb97x-d3
keywords: def2-TZVPP
keywords: def2/J RIJCOSX GRIDX6 NOFINALGRIDX
keywords: grid4 nofinalgrid
keywords: scfconv7
keywords: smallprint printgap noloewdin
keywords: NOSOSCF
formula: C16H18N4O7S
InChI: InChI=1S/C16H18N4O7S/c1-25-12-8-13(26-2)18-15(17-12)19-16(22)20-28(23,24)9-10-6-4-5-7-11(10)14(21)27-3/h4-8,19-20H,9H2,1-3H3
46 atoms
S  1.203263 -2.785154 -0.552293
O  0.127985 -3.354709 -1.343305
O  2.22846 -3.621973 0.012478
O  3.476546 0.860845 -0.551924
O  2.141575 2.148313 0.684238
O  2.196413 -1.014945 1.675418
O  -3.653383 -0.628661 -0.529129
O  -2.915215 3.304777 1.826037
N  0.385021 -1.933117 0.639303
N  0.185318 -0.023897 1.954384
N  -1.758438 -0.375049 0.72089
N  -1.376776 1.626229 1.909188
C  2.013707 -1.475626 -1.518497
C  1.090851 -0.318164 -1.763899
C  1.182863 0.918836 -1.105222
C  0.013661 -0.529487 -2.624255
C  0.169625 1.86319 -1.274592
C  -0.967738 0.428139 -2.808636
C  -0.901249 1.625703 -2.114945
C  2.298833 1.362679 -0.212997
C  1.013773 -1.009504 1.436789
C  -1.038558 0.417242 1.49926
C  -2.908553 0.112572 0.269577
C  -2.530939 2.093989 1.462319
C  -3.362931 1.376231 0.610241
C  4.572513 1.162722 0.308116
C  -3.216454 -1.94124 -0.85429
C  -2.059139 4.055388 2.674688
H  2.293399 -1.975232 -2.449041
H  2.922382 -1.219876 -0.986592
H  -0.062428 -1.472146 -3.149254
H  -0.605506 -1.749284 0.438753
H  0.237187 2.800367 -0.739665
H  -1.788986 0.233065 -3.485468
H  -1.673288 2.373614 -2.232434
H  0.685867 0.669387 2.492825
H  -4.301182 1.769172 0.249899
H  5.423867 0.624122 -0.097775
H  4.78663 2.231053 0.317413
H  4.375258 0.823482 1.323853
H  -2.267826 -1.936762 -1.391198
H  -3.116015 -2.566572 0.03386
H  -3.988985 -2.356407 -1.495788
H  -1.921758 3.570032 3.641189
H  -1.078535 4.212349 2.224562
H  -2.554038 5.012418 2.816473
totalener: -1764.50252564 hartree
nucrepener: 3206.50340135 hartree
electener: -4971.00592699 hartree
oneelecener: -8795.48675833 hartree
twoeener: 3824.48083134 hartree
kineticenergy: 1758.18831190 hartree
xcener: -145.284839873913 hartree
chargesum: 0.0000000
charge: 0.836435 -0.479727 -0.417100 -0.278862 -0.368325 -0.350098 -0.262435 -0.264064 -0.171101 -0.154760 -0.391242 -0.368725 -0.223890 -0.102432 0.084413 -0.165249 -0.069602 -0.123642 -0.140654 0.383758 0.231090 0.302102 0.400924 0.393855 -0.322591 -0.128498 -0.119822 -0.125366 0.142183 0.170123 0.138322 0.192557 0.131946 0.140462 0.132609 0.182724 0.124180 0.115926 0.115586 0.125944 0.095377 0.115878 0.127843 0.108310 0.113250 0.122388
qa: 0.8364 -0.4797 -0.4171 -0.2789 -0.3683 -0.3501 -0.2624 -0.2641 -0.1711 -0.1548 -0.3912 -0.3687 -0.2239 -0.1024 0.0844 -0.1652 -0.0696 -0.1236 -0.1407 0.3838 0.2311 0.3021 0.4009 0.3939 -0.3226 -0.1285 -0.1198 -0.1254 0.1422 0.1701 0.1383 0.1926 0.1319 0.1405 0.1326 0.1827 0.1242 0.1159 0.1156 0.1259 0.0954 0.1159 0.1278 0.1083 0.1133 0.1224
va: 5.7726 1.9920 2.0902 2.1310 2.1173 2.1451 2.1425 2.1485 3.0941 3.1721 2.9345 2.9331 3.8273 3.7293 3.5224 3.9522 3.8451 3.8722 3.9138 4.1387 4.5136 4.3022 3.9779 4.0253 3.9218 3.8710 3.8672 3.8758 1.0135 1.0335 1.0164 1.0874 1.0230 0.9960 1.0013 1.0297 1.0247 0.9947 0.9941 1.0001 0.9904 0.9953 0.9966 0.9974 0.9954 0.9933
dispcorr: -0.034673097 hartree
energy: -1764.537198736618
dipole: -2.55048 1.58675 -0.96373 10.53196 -8.70535 1.82661 -2.63896 1.99410 -0.64486
magnitude: 2.16359 au
magnitude: 5.49940 debye
