program: Orca
programVersion: 4.2.1
elementType: Cl S O O O O O O N N N N C C C C C C C C C C C C C C C H H H H H H H H H H H H H H H
charge: 0
multiplicity: 1
keywords: wb97x-d3
keywords: def2-TZVPP
keywords: def2/J RIJCOSX GRIDX6 NOFINALGRIDX
keywords: grid4 nofinalgrid
keywords: scfconv7
keywords: smallprint printgap noloewdin
keywords: NOSOSCF
formula: C15H15ClN4O6S
InChI: InChI=1S/C15H15ClN4O6S/c1-3-26-13(21)9-6-4-5-7-10(9)27(23,24)20-15(22)19-14-17-11(16)8-12(18-14)25-2/h4-8,19-20H,3H2,1-2H3
42 atoms
Cl -2.880178 1.303278 2.018047
S  1.315011 -2.093239 0.917371
O  2.307342 1.461079 2.092604
O  1.505244 -3.523597 0.809721
O  1.137057 -1.485619 2.224377
O  0.763972 1.20606 0.486635
O  0.57577 -2.548556 -1.901099
O  -4.648688 1.714255 -2.638839
N  -0.056062 -1.654764 0.087655
N  -1.240939 -1.211848 -1.861189
N  -2.943847 0.246015 -2.255601
N  -2.106221 -0.018247 -0.065925
C  2.656359 -1.275046 0.102332
C  2.847801 0.096298 0.279253
C  3.557748 -2.04029 -0.619742
C  3.967999 0.689741 -0.282403
C  4.665021 -1.428183 -1.187958
C  4.869191 -0.069078 -1.017638
C  1.843985 0.96972 0.964136
C  -0.183208 -1.852982 -1.260306
C  1.432268 2.305286 2.873264
C  -2.130025 -0.289909 -1.357807
C  1.41932 3.731073 2.378762
C  -3.799305 1.145197 -1.811742
C  -3.848042 1.545408 -0.467322
C  -2.951452 0.912219 0.347551
C  -4.61996 1.353173 -4.021185
H  3.413448 -3.104312 -0.737846
H  4.13609 1.751273 -0.158243
H  -0.681313 -0.962616 0.526251
H  5.368147 -2.02038 -1.756402
H  5.734929 0.408582 -1.455065
H  -1.315207 -1.38305 -2.855547
H  1.838135 2.248655 3.880757
H  0.428875 1.877171 2.886861
H  0.968045 3.824552 1.392142
H  0.830036 4.333194 3.071593
H  2.424623 4.1513 2.346576
H  -4.54055 2.295499 -0.117458
H  -4.829511 0.293844 -4.162091
H  -3.661623 1.599103 -4.476391
H  -5.40307 1.940416 -4.491082
elementType: Cl S O N C H
totalener: -2109.58097156 hartree
nucrepener: 3008.14232982 hartree
electener: -5117.72330138 hartree
oneelecener: -8880.29389872 hartree
twoeener: 3762.57059734 hartree
cpcmener: -0.04693573 hartree
kineticenergy: 2103.04380989 hartree
xcener: -155.811355761986 hartree
chargesum: 0.0000000
charge: -0.052891 0.885531 -0.278354 -0.505530 -0.513318 -0.416791 -0.476862 -0.286617 -0.199447 -0.131410 -0.406294 -0.354434 -0.125052 0.071415 -0.023720 -0.184893 -0.163599 -0.112231 0.423850 0.374807 0.047997 0.394955 -0.261118 0.398834 -0.227626 0.199456 -0.114743 0.149734 0.150256 0.200969 0.168635 0.168798 0.195436 0.117208 0.083686 0.090378 0.100992 0.092507 0.148177 0.117764 0.118456 0.135084
qa: -0.0529 0.8855 -0.2784 -0.5055 -0.5133 -0.4168 -0.4769 -0.2866 -0.1994 -0.1314 -0.4063 -0.3544 -0.1251 0.0714 -0.0237 -0.1849 -0.1636 -0.1122 0.4238 0.3748 0.0480 0.3950 -0.2611 0.3988 -0.2276 0.1995 -0.1147 0.1497 0.1503 0.2010 0.1686 0.1688 0.1954 0.1172 0.0837 0.0904 0.1010 0.0925 0.1482 0.1178 0.1185 0.1351
va: 1.2529 5.8118 2.1381 1.9926 1.9728 2.0710 2.0363 2.1480 3.0712 3.1905 2.9929 3.0022 3.7845 3.7111 3.8552 4.0031 3.9456 3.8899 4.1027 4.4100 3.8357 4.1928 3.9249 4.0643 3.9911 4.1286 3.8383 1.0196 1.0044 1.0897 0.9868 0.9856 1.0142 0.9972 1.0142 1.0122 1.0048 1.0042 1.0106 0.9947 0.9949 0.9929
dispcorr: -0.024145945 hartree
energy: -2109.605117505204
dipole: 8.26826 -8.96860 -0.70034 15.10721 -11.60499 3.50222 -8.27235 6.21477 -2.05758
magnitude: 4.12185 au
magnitude: 10.47691 debye
