program: Orca
programVersion: 4.2.1
elementType: Cl S O O O O O O N N N N C C C C C C C C C C C C C C C H H H H H H H H H H H H H H H
charge: 0
multiplicity: 1
keywords: wb97x-d3
keywords: def2-TZVPP
keywords: def2/J RIJCOSX GRIDX6 NOFINALGRIDX
keywords: grid4 nofinalgrid
keywords: scfconv7
keywords: smallprint printgap noloewdin
keywords: NOSOSCF
formula: C15H15ClN4O6S
InChI: InChI=1S/C15H15ClN4O6S/c1-3-26-13(21)9-6-4-5-7-10(9)27(23,24)20-15(22)19-14-17-11(16)8-12(18-14)25-2/h4-8,19-20H,3H2,1-2H3
42 atoms
Cl -5.43849 -0.569824 -2.32428
S  1.588046 -0.683843 1.953115
O  2.467914 2.208087 -0.83633
O  1.93205 -1.633003 2.989995
O  1.631958 0.738483 2.241613
O  0.601281 0.988057 -0.660037
O  0.333893 -3.112114 0.844807
O  -2.823436 2.309812 0.812606
N  0.018871 -0.953075 1.47175
N  -1.556862 -2.07451 0.181375
N  -2.19773 0.130842 0.544862
N  -3.369236 -1.277182 -0.940638
C  2.609448 -1.009638 0.53781
C  2.714362 -0.083615 -0.503358
C  3.398662 -2.148072 0.564324
C  3.637659 -0.321218 -1.511815
C  4.296416 -2.382379 -0.466671
C  4.418782 -1.468419 -1.498288
C  1.802844 1.089288 -0.651479
C  -0.349013 -2.109576 0.838667
C  1.706686 3.40896 -1.088911
C  -2.403037 -1.020114 -0.076636
C  2.684074 4.533849 -1.300847
C  -3.000263 1.136769 0.245386
C  -4.05361 0.992808 -0.660574
C  -4.170842 -0.262401 -1.203554
C  -1.739055 2.481755 1.727862
H  3.330265 -2.850725 1.381245
H  3.737945 0.381102 -2.327947
H  -0.580858 -0.1301 1.32514
H  4.903893 -3.276068 -0.451211
H  5.124361 -1.641967 -2.298734
H  -1.792514 -2.937225 -0.291698
H  1.057896 3.607826 -0.234767
H  1.079207 3.260517 -1.968232
H  2.128422 5.453044 -1.482799
H  3.312346 4.692873 -0.425388
H  3.323358 4.354906 -2.164483
H  -4.716358 1.808627 -0.904131
H  -1.807623 3.509053 2.072662
H  -0.779263 2.336633 1.233147
H  -1.825233 1.811422 2.5825
elementType: Cl S O N C H
totalener: -2109.58289920 hartree
nucrepener: 3005.15225905 hartree
electener: -5114.73515825 hartree
oneelecener: -8873.17455962 hartree
twoeener: 3758.43940137 hartree
cpcmener: -0.04477271 hartree
kineticenergy: 2103.04735587 hartree
xcener: -155.812469704451 hartree
chargesum: 0.0000000
charge: -0.052499 0.894513 -0.275436 -0.508551 -0.517342 -0.440031 -0.473496 -0.283110 -0.199834 -0.133638 -0.395014 -0.358512 -0.147552 0.088136 -0.009689 -0.197394 -0.165571 -0.106507 0.461669 0.368504 0.044665 0.397431 -0.253066 0.408529 -0.261066 0.193410 -0.111305 0.148328 0.149130 0.213173 0.169145 0.169379 0.193647 0.103182 0.102307 0.091392 0.090776 0.091794 0.152665 0.143887 0.082103 0.131848
qa: -0.0525 0.8945 -0.2754 -0.5086 -0.5173 -0.4400 -0.4735 -0.2831 -0.1998 -0.1336 -0.3950 -0.3585 -0.1476 0.0881 -0.0097 -0.1974 -0.1656 -0.1065 0.4617 0.3685 0.0447 0.3974 -0.2531 0.4085 -0.2611 0.1934 -0.1113 0.1483 0.1491 0.2132 0.1691 0.1694 0.1936 0.1032 0.1023 0.0914 0.0908 0.0918 0.1527 0.1439 0.0821 0.1318
va: 1.2533 5.8002 2.1524 1.9874 1.9683 2.0521 2.0402 2.1569 3.0834 3.1973 2.9922 3.0036 3.7843 3.6701 3.8389 4.0249 3.9538 3.8970 4.0592 4.4157 3.8407 4.1958 3.9751 4.0384 3.9653 4.2188 3.8348 1.0216 1.0110 1.0671 0.9866 0.9855 1.0167 0.9866 0.9967 1.0060 1.0032 1.0027 1.0102 0.9961 0.9953 0.9914
dispcorr: -0.024898571 hartree
energy: -2109.607797775806
dipole: 23.36118 -23.01905 0.34213 20.58241 -18.22294 2.35947 -1.16219 -1.16613 -2.32832
magnitude: 3.33245 au
magnitude: 8.47042 debye
