program: Orca
programVersion: 4.2.1
elementType: Cl S O O O O O O N N N N C C C C C C C C C C C C C C C H H H H H H H H H H H H H H H
charge: 0
multiplicity: 1
keywords: wb97x-d3
keywords: def2-TZVPP
keywords: def2/J RIJCOSX GRIDX6 NOFINALGRIDX
keywords: grid4 nofinalgrid
keywords: scfconv7
keywords: smallprint printgap noloewdin
keywords: NOSOSCF
formula: C15H15ClN4O6S
InChI: InChI=1S/C15H15ClN4O6S/c1-3-26-13(21)9-6-4-5-7-10(9)27(23,24)20-15(22)19-14-17-11(16)8-12(18-14)25-2/h4-8,19-20H,3H2,1-2H3
42 atoms
Cl -5.75757 -0.584957 1.481373
S  1.861913 -0.681943 -1.665383
O  2.398511 2.23305 1.142723
O  1.957041 0.73862 -1.949808
O  2.339525 -1.640301 -2.638846
O  0.540311 1.044147 0.76921
O  0.441967 -3.101926 -0.760704
O  -2.690249 2.325305 -1.182376
N  0.237864 -0.935017 -1.40624
N  -1.523396 -2.060538 -0.386362
N  -2.100376 0.14917 -0.825008
N  -3.492584 -1.275379 0.438682
C  2.666243 -1.008394 -0.117669
C  2.629947 -0.073325 0.919531
C  3.427924 -2.161377 -0.015827
C  3.382181 -0.316815 2.059862
C  4.152668 -2.400757 1.142324
C  4.132541 -1.478966 2.17451
C  1.735343 1.121942 0.911672
C  -0.229267 -2.095472 -0.850466
C  1.642157 3.459201 1.242452
C  -2.401063 -1.00847 -0.256792
C  2.610309 4.570752 1.548895
C  -2.948371 1.148311 -0.655728
C  -4.1336 0.993927 0.067238
C  -4.329565 -0.264806 0.578714
C  -1.474078 2.508268 -1.910048
H  3.471082 -2.870676 -0.828806
H  3.369526 0.39267 2.875923
H  -0.367749 -0.106669 -1.343336
H  4.738433 -3.305055 1.2269
H  4.702647 -1.658467 3.075292
H  -1.832078 -2.928577 0.032056
H  0.893413 3.359798 2.029722
H  1.124728 3.637777 0.29794
H  2.059042 5.508434 1.614734
H  3.115896 4.413795 2.50194
H  3.36105 4.680151 0.766041
H  -4.831395 1.805298 0.20545
H  -0.605578 2.36997 -1.266616
H  -1.494946 3.535497 -2.261208
H  -1.414446 1.838826 -2.76763
elementType: Cl S O N C H
totalener: -2109.58334562 hartree
nucrepener: 3000.84747675 hartree
electener: -5110.43082237 hartree
oneelecener: -8864.57736151 hartree
twoeener: 3754.14653914 hartree
cpcmener: -0.04498185 hartree
kineticenergy: 2103.03715333 hartree
xcener: -155.810591516732 hartree
chargesum: -0.0000000
charge: -0.052411 0.895568 -0.274822 -0.517223 -0.508357 -0.441933 -0.474547 -0.283172 -0.199733 -0.132697 -0.397481 -0.359362 -0.146492 0.088636 -0.008152 -0.198305 -0.165082 -0.106148 0.459616 0.370361 0.045647 0.397290 -0.254594 0.409009 -0.260690 0.193575 -0.109765 0.147962 0.149232 0.214065 0.169453 0.169185 0.193680 0.102887 0.102343 0.091712 0.091642 0.091195 0.152453 0.080830 0.143508 0.131117
qa: -0.0524 0.8956 -0.2748 -0.5172 -0.5084 -0.4419 -0.4745 -0.2832 -0.1997 -0.1327 -0.3975 -0.3594 -0.1465 0.0886 -0.0082 -0.1983 -0.1651 -0.1061 0.4596 0.3704 0.0456 0.3973 -0.2546 0.4090 -0.2607 0.1936 -0.1098 0.1480 0.1492 0.2141 0.1695 0.1692 0.1937 0.1029 0.1023 0.0917 0.0916 0.0912 0.1525 0.0808 0.1435 0.1311
va: 1.2534 5.7993 2.1523 1.9686 1.9877 2.0491 2.0392 2.1576 3.0856 3.1973 2.9897 3.0046 3.7843 3.6716 3.8381 4.0239 3.9527 3.8958 4.0587 4.4127 3.8391 4.1958 3.9762 4.0366 3.9651 4.2185 3.8347 1.0218 1.0103 1.0633 0.9865 0.9855 1.0168 0.9965 0.9876 1.0059 1.0028 1.0029 1.0103 0.9970 0.9963 0.9916
dispcorr: -0.024799242 hartree
energy: -2109.608144859280
dipole: 23.42752 -23.39381 0.03371 20.75510 -18.39105 2.36405 4.28103 -1.96652 2.31451
magnitude: 3.30860 au
magnitude: 8.40979 debye
