program: Orca
programVersion: 4.2.1
elementType: Cl S O O O O O O N N N N C C C C C C C C C C C C C C C H H H H H H H H H H H H H H H
charge: 0
multiplicity: 1
keywords: wb97x-d3
keywords: def2-TZVPP
keywords: def2/J RIJCOSX GRIDX6 NOFINALGRIDX
keywords: grid4 nofinalgrid
keywords: scfconv7
keywords: smallprint printgap noloewdin
keywords: NOSOSCF
formula: C15H15ClN4O6S
InChI: InChI=1S/C15H15ClN4O6S/c1-3-26-13(21)9-6-4-5-7-10(9)27(23,24)20-15(22)19-14-17-11(16)8-12(18-14)25-2/h4-8,19-20H,3H2,1-2H3
42 atoms
Cl -5.556009 -0.660963 -2.255064
S  1.57797 -0.663867 1.914818
O  2.611391 2.246322 -0.768043
O  1.88784 -1.62035 2.955755
O  1.632185 0.756705 2.209205
O  0.698321 1.087086 -0.67849
O  0.309294 -3.092503 0.830848
O  -2.847652 2.338356 0.68148
N  0.016107 -0.913613 1.399034
N  -1.581916 -2.063053 0.160356
N  -2.20839 0.157043 0.458262
N  -3.435003 -1.310998 -0.922538
C  2.621856 -0.998259 0.519329
C  2.76986 -0.061217 -0.506706
C  3.378561 -2.158733 0.542435
C  3.699971 -0.310972 -1.505646
C  4.28505 -2.403769 -0.478726
C  4.447436 -1.480607 -1.496814
C  1.902498 1.146299 -0.640568
C  -0.367436 -2.085882 0.804979
C  1.901302 3.485801 -0.977826
C  -2.437369 -1.018692 -0.106586
C  2.92428 4.576362 -1.152175
C  -3.032735 1.146101 0.159462
C  -4.1192 0.964994 -0.69954
C  -4.249426 -0.308872 -1.193666
C  -1.741446 2.54952 1.561394
H  3.278826 -2.870662 1.348085
H  3.833529 0.400388 -2.309187
H  -0.568363 -0.08523 1.227024
H  4.867737 -3.31389 -0.466117
H  5.15963 -1.663484 -2.289418
H  -1.829837 -2.941185 -0.276932
H  1.262931 3.680879 -0.114775
H  1.266588 3.3950 -1.859601
H  3.553071 4.403507 -2.024898
H  2.406598 5.523728 -1.297512
H  3.561463 4.677383 -0.274377
H  -4.796755 1.768133 -0.944554
H  -1.824847 3.580175 1.893215
H  -0.79388 2.418769 1.039824
H  -1.786888 1.890865 2.428165
elementType: Cl S O N C H
totalener: -2109.58357766 hartree
nucrepener: 2994.35470976 hartree
electener: -5103.93828742 hartree
oneelecener: -8851.59795440 hartree
twoeener: 3747.65966699 hartree
cpcmener: -0.04509367 hartree
kineticenergy: 2103.03572734 hartree
xcener: -155.810719570316 hartree
chargesum: 0.0000000
charge: -0.052633 0.895372 -0.274272 -0.508135 -0.517992 -0.442997 -0.475553 -0.283038 -0.200589 -0.133357 -0.399257 -0.360165 -0.147723 0.088039 -0.006628 -0.197783 -0.166385 -0.106209 0.460940 0.373347 0.045177 0.399931 -0.253684 0.409165 -0.260778 0.192985 -0.111515 0.147806 0.149292 0.215254 0.169190 0.169352 0.193617 0.102465 0.102820 0.091921 0.091491 0.090815 0.152574 0.144137 0.084867 0.128134
qa: -0.0526 0.8954 -0.2743 -0.5081 -0.5180 -0.4430 -0.4756 -0.2830 -0.2006 -0.1334 -0.3993 -0.3602 -0.1477 0.0880 -0.0066 -0.1978 -0.1664 -0.1062 0.4609 0.3733 0.0452 0.3999 -0.2537 0.4092 -0.2608 0.1930 -0.1115 0.1478 0.1493 0.2153 0.1692 0.1694 0.1936 0.1025 0.1028 0.0919 0.0915 0.0908 0.1526 0.1441 0.0849 0.1281
va: 1.2532 5.7994 2.1515 1.9885 1.9677 2.0480 2.0381 2.1588 3.0885 3.1977 2.9912 3.0036 3.7831 3.6713 3.8373 4.0259 3.9536 3.8967 4.0594 4.4110 3.8370 4.1940 3.9765 4.0373 3.9640 4.2186 3.8344 1.0222 1.0107 1.0613 0.9867 0.9855 1.0169 0.9887 0.9969 1.0026 1.0059 1.0030 1.0103 0.9961 0.9980 0.9924
dispcorr: -0.024630064 hartree
energy: -2109.608207721466
dipole: 24.46430 -24.02571 0.43858 21.02572 -18.66809 2.35763 -1.06897 -1.25246 -2.32143
magnitude: 3.33763 au
magnitude: 8.48359 debye
